{"text_format":"1","workbook":"xlsx","n_sheets":2,"sheets":["Отчет","Данные"],"not_rendered":{"charts":0,"images":1,"macros":1,"external_links":0,"defined_names":0,"comments":0,"pivot_tables":0},"unopened":[],"bounds":{"document_bytes":16777216,"sheet_cells":100000,"rows_first":2000,"rows_last":500,"rows_between":2000,"halvings":0,"cell_chars":16384,"cell_head_chars":4096},"cells_cut":0,"cells_raw":0,"read":"whole","date_system":"1900"}

{"sheet":"Отчет","index":0,"n_rows":80,"n_cols":42,"rows_kept":80,"cut":false,"hidden":false,"merged":[[62,0,63,0],[72,0,73,0],[37,0,38,0],[39,0,40,0],[47,0,48,0],[50,0,51,0],[53,0,56,0],[57,0,59,0],[16,0,17,0],[20,0,22,0],[24,0,25,0],[26,0,27,0],[31,0,32,0],[35,0,36,0],[7,2,9,2],[8,8,8,18],[7,8,7,21],[8,19,8,21],[8,22,8,26],[7,22,7,29],[8,27,8,29],[7,34,10,34],[7,1,9,1],[7,0,9,0],[1,36,2,39],[0,36,0,39],[7,37,10,37],[7,35,10,35],[7,6,9,6],[7,4,9,4],[7,3,9,3],[7,5,9,5],[7,40,10,40],[10,0,10,6],[7,39,10,39],[7,30,10,30],[7,33,10,33],[7,36,10,36],[7,31,10,31],[7,38,10,38],[7,32,10,32]]}
["Текущий рейтинг студентов (до пересдач)",null,null,null,null,null,null,null,null,null,null,null,null,null,null,null,null,null,null,null,null,null,null,null,null,null,null,null,null,null,null,null,null,null,null,null,"Приложение 3"]
["Дата выгрузки: 07.07.2015",null,null,null,null,null,null,null,null,null,null,null,null,null,null,null,null,null,null,null,null,null,null,null,null,null,null,null,null,null,null,null,null,null,null,null,"к Положению о рейтинговой системе комплексной оценки знаний студентов "]
["Период: c 2014/2015 учебный год II семестр по 2014/2015 учебный год II семестр"]
["Факультет/отделение: Факультет коммуникаций, медиа и дизайна"]
["Направление  подготовки: Направление \"Журналистика\""]
["Уровень образования, номер курса: Бакалавриат 4 курс",null,null,null,null,null,null,null,null," - студенты имеющие задолженности"]
[null,null,null,null,null,null,null,null,"*"," - изучение по ИУП"]
["Место","Номер зачетной книжки","Студент","ID","Группа","Образовательная программа студента","Вид места",null,"2014/2015 учебный год 3 модуль",null,null,null,null,null,null,null,null,null,null,null,null,null,"2014/2015 учебный год 4 модуль",null,null,null,null,null,null,null,"Кредитно-рейтинговая оценка","Нормировочный коэффициент","Сумма всех кредитов ","Нормированная кредитно-рейтинговая оценка","Сумма всех оценок","Количество всех оценок","Средний балл","Минимальный балл","Наличие неудовлетворительных оценок и неявок","Количество удовлетворительных оценок","Номер места"]
[null,null,null,null,null,null,null,null,"Экзамен",null,null,null,null,null,null,null,null,null,null,"Зачет",null,null,"Экзамен",null,null,null,null,"Зачет"]
[null,null,null,null,null,null,null,"Номер Row","Государственная информационная политика","Деловая журналистика","Деловая журналистика","Иностранный язык (английский) (итоговый госэкзамен)","Иностранный язык (английский)","Мастерство ведущего теле- и радио программ","Современные коммуникативные технологии","Теория и практика русского литературного языка","Цифровой кинематограф: новые концепции визуального","Эволюция взаимоотношений медиа и бизнеса в России","Эволюция взаимоотношений медиа и бизнеса в России","Мастерство ведущего теле- и радио программ","Продюсерское мастерство","Цифровой кинематограф: новые концепции визуального","Второй иностранный язык (французский)","Курсовая работа","Междисциплинарный экзамен по направлению подготовки (итоговый госэкзамен)","Подготовка и защита выпускной квалификационной работы","Преддипломная практика","Преддипломная практика","Физическая культура","Физическая культура"]
["Число текущих кредитов:",null,null,null,null,null,null,null,3,5.5,9,3,4,3,5.5,6,3,3,4,3,3,3,4.1399999999999997,5,3,6,5,4,0.17,1]
[1,"1104126","Павленко Валентина Юрьевна",475528836,"447ж","Журналистика","Бюдж",{"$f":"MATCH(D12,Данные!$D:$D,0)","v":76},null,null,10,10,10,null,null,10,null,10,null,null,null,null,null,null,10,10,10,null,null,10,400,{"$f":"IF(AG12 > 0, MAX(AG$12:AG$80) / AG12, 0)","v":1.125},40,{"$f":"AE12*AF12","v":450},90,9,{"$f":"IF(AJ12 > 0,AI12/AJ12,0)","v":10},{"$f":"MIN($I12:AD12)","v":10},null,9,1,"ОК"]
[2,"1114153","Гликин Константин Максимович",475517709,"445ж","Журналистика","Бюдж",{"$f":"MATCH(D13,Данные!$D:$D,0)","v":57},null,null,10,10,10,null,null,9,null,10,null,null,null,null,null,null,10,10,10,null,null,10,394,{"$f":"IF(AG13 > 0, MAX(AG$12:AG$80) / AG13, 0)","v":1.125},40,{"$f":"AE13*AF13","v":443.25},89,9,{"$f":"IF(AJ13 > 0,AI13/AJ13,0)","v":9.8888888888888893},{"$f":"MIN($I13:AD13)","v":9},null,9,2,"ОК"]
[3,"1104101","Агрызкова Юлия Игоревна",475522967,"447ж","Журналистика","Бюдж",{"$f":"MATCH(D14,Данные!$D:$D,0)","v":22},null,null,9,8,10,null,null,8,null,10,null,null,null,null,null,null,10,10,10,null,null,10,373,{"$f":"IF(AG14 > 0, MAX(AG$12:AG$80) / AG14, 0)","v":1.125},40,{"$f":"AE14*AF14","v":419.625},85,9,{"$f":"IF(AJ14 > 0,AI14/AJ14,0)","v":9.4444444444444446},{"$f":"MIN($I14:AD14)","v":8},null,9,3,"ОК"]
[4,"1104132","Разумовская Мария Алексеевна",475529260,"447ж","Журналистика","Бюдж",{"$f":"MATCH(D15,Данные!$D:$D,0)","v":14},10,null,10,9,9,null,null,9,null,null,null,null,null,null,null,null,9,8,10,null,null,10,372,{"$f":"IF(AG15 > 0, MAX(AG$12:AG$80) / AG15, 0)","v":1.125},40,{"$f":"AE15*AF15","v":418.5},84,9,{"$f":"IF(AJ15 > 0,AI15/AJ15,0)","v":9.3333333333333339},{"$f":"MIN($I15:AD15)","v":8},null,9,4,"ОК"]
[5,"1104110","Сорокина Мария Михайловна",475526257,"447ж","Журналистика","Бюдж",{"$f":"MATCH(D16,Данные!$D:$D,0)","v":70},null,null,10,8,8,10,null,8,null,null,null,null,null,null,null,null,10,9,10,null,null,10,368,{"$f":"IF(AG16 > 0, MAX(AG$12:AG$80) / AG16, 0)","v":1.125},40,{"$f":"AE16*AF16","v":414},83,9,{"$f":"IF(AJ16 > 0,AI16/AJ16,0)","v":9.2222222222222214},{"$f":"MIN($I16:AD16)","v":8},null,9,5,"ОК"]
["6 - 7","1104115","Кристалинская Мария Валерьевна",475527155,"447ж","Журналистика","Бюдж",{"$f":"MATCH(D17,Данные!$D:$D,0)","v":72},null,null,9,9,9,null,null,8,null,10,null,null,null,null,null,null,10,9,10,null,null,10,366,{"$f":"IF(AG17 > 0, MAX(AG$12:AG$80) / AG17, 0)","v":1.125},40,{"$f":"AE17*AF17","v":411.75},84,9,{"$f":"IF(AJ17 > 0,AI17/AJ17,0)","v":9.3333333333333339},{"$f":"MIN($I17:AD17)","v":8},null,9,6,"ОК"]
[null,"1114146","Бабаянц Виолетта Владимировна",481545758,"447ж","Журналистика","Комм",{"$f":"MATCH(D18,Данные!$D:$D,0)","v":37},null,null,9,7,10,10,null,9,null,null,null,null,null,null,null,null,10,10,8,null,null,10,366,{"$f":"IF(AG18 > 0, MAX(AG$12:AG$80) / AG18, 0)","v":1.125},40,{"$f":"AE18*AF18","v":411.75},83,9,{"$f":"IF(AJ18 > 0,AI18/AJ18,0)","v":9.2222222222222214},{"$f":"MIN($I18:AD18)","v":7},null,9,7,"ОК"]
[8,"1114185","Ткачук Анфиса Сергеевна",481543686,"446ж","Журналистика","Бюдж",{"$f":"MATCH(D19,Данные!$D:$D,0)","v":34},null,null,8,9,10,null,null,10,9,null,null,null,null,null,null,null,9,8,10,null,null,10,361,{"$f":"IF(AG19 > 0, MAX(AG$12:AG$80) / AG19, 0)","v":1.125},40,{"$f":"AE19*AF19","v":406.125},83,9,{"$f":"IF(AJ19 > 0,AI19/AJ19,0)","v":9.2222222222222214},{"$f":"MIN($I19:AD19)","v":8},null,9,8,"ОК"]
[9,"1104128","Пожидаева Ирина Владимировна",475581231,"446ж","Журналистика","Бюдж",{"$f":"MATCH(D20,Данные!$D:$D,0)","v":63},null,null,9,9,10,null,null,8,10,null,null,null,null,null,null,null,6,9,10,null,null,10,358,{"$f":"IF(AG20 > 0, MAX(AG$12:AG$80) / AG20, 0)","v":1.125},40,{"$f":"AE20*AF20","v":402.75},81,9,{"$f":"IF(AJ20 > 0,AI20/AJ20,0)","v":9},{"$f":"MIN($I20:AD20)","v":6},null,9,9,"ОК"]
["10 - 12","1104139","Фалькон Анастасия Александровна",475529718,"447ж","Журналистика","Бюдж",{"$f":"MATCH(D21,Данные!$D:$D,0)","v":3},10,null,9,10,10,null,null,7,null,null,null,null,null,null,null,null,8,10,8,null,null,10,357,{"$f":"IF(AG21 > 0, MAX(AG$12:AG$80) / AG21, 0)","v":1.125},40,{"$f":"AE21*AF21","v":401.625},82,9,{"$f":"IF(AJ21 > 0,AI21/AJ21,0)","v":9.1111111111111107},{"$f":"MIN($I21:AD21)","v":7},null,9,10,"ОК"]
[null,"1004107","Василиади Елена Христоевна",481546380,"447ж","Журналистика","Комм",{"$f":"MATCH(D22,Данные!$D:$D,0)","v":38},null,null,10,9,10,10,null,8,null,null,null,null,null,null,null,null,6,9,8,null,null,10,357,{"$f":"IF(AG22 > 0, MAX(AG$12:AG$80) / AG22, 0)","v":1.125},40,{"$f":"AE22*AF22","v":401.625},80,9,{"$f":"IF(AJ22 > 0,AI22/AJ22,0)","v":8.8888888888888893},{"$f":"MIN($I22:AD22)","v":6},null,9,11,"ОК"]
[null,"1114176","Романова Юлия Владимировна",481543173,"446ж","Журналистика","Комм",{"$f":"MATCH(D23,Данные!$D:$D,0)","v":33},null,null,9,7,9,null,null,8,10,null,null,null,null,null,null,null,7,10,10,null,null,10,357,{"$f":"IF(AG23 > 0, MAX(AG$12:AG$80) / AG23, 0)","v":1.125},40,{"$f":"AE23*AF23","v":401.625},80,9,{"$f":"IF(AJ23 > 0,AI23/AJ23,0)","v":8.8888888888888893},{"$f":"MIN($I23:AD23)","v":7},null,9,12,"ОК"]
[13,"1104120","Львова Анастасия Артуровна",475528055,"447ж","Журналистика","Бюдж",{"$f":"MATCH(D24,Данные!$D:$D,0)","v":74},null,null,9,10,9,null,null,8,9,null,null,null,null,null,null,null,10,8,9,null,null,10,355,{"$f":"IF(AG24 > 0, MAX(AG$12:AG$80) / AG24, 0)","v":1.125},40,{"$f":"AE24*AF24","v":399.375},82,9,{"$f":"IF(AJ24 > 0,AI24/AJ24,0)","v":9.1111111111111107},{"$f":"MIN($I24:AD24)","v":8},null,9,13,"ОК"]
["14 - 15","1104123","Мухаметдинова Элина Шамилевна",475583224,"447ж","Журналистика","Бюдж",{"$f":"MATCH(D25,Данные!$D:$D,0)","v":13},10,null,8,10,9,null,null,8,null,null,null,null,null,null,null,null,8,9,10,null,null,10,354,{"$f":"IF(AG25 > 0, MAX(AG$12:AG$80) / AG25, 0)","v":1.125},40,{"$f":"AE25*AF25","v":398.25},82,9,{"$f":"IF(AJ25 > 0,AI25/AJ25,0)","v":9.1111111111111107},{"$f":"MIN($I25:AD25)","v":8},null,9,14,"ОК"]
[null,"1104107","Данилова Анастасия Андреевна",481532910,"445ж","Журналистика","Комм",{"$f":"MATCH(D26,Данные!$D:$D,0)","v":7},10,null,8,9,8,null,null,9,null,null,null,null,null,null,null,null,8,10,9,null,null,10,354,{"$f":"IF(AG26 > 0, MAX(AG$12:AG$80) / AG26, 0)","v":1.125},40,{"$f":"AE26*AF26","v":398.25},81,9,{"$f":"IF(AJ26 > 0,AI26/AJ26,0)","v":9},{"$f":"MIN($I26:AD26)","v":8},null,9,15,"ОК"]
["16 - 17","1104127","Пенкина Анастасия Валерьевна",475521309,"446ж","Журналистика","Бюдж",{"$f":"MATCH(D27,Данные!$D:$D,0)","v":86},null,null,8,10,10,null,null,10,8,null,null,null,null,null,null,null,9,8,8,null,null,10,351,{"$f":"IF(AG27 > 0, MAX(AG$12:AG$80) / AG27, 0)","v":1.125},40,{"$f":"AE27*AF27","v":394.875},81,9,{"$f":"IF(AJ27 > 0,AI27/AJ27,0)","v":9},{"$f":"MIN($I27:AD27)","v":8},null,9,16,"ОК"]
[null,"1114186","Федотова Елена Андреевна",481544213,"446ж","Журналистика","Комм",{"$f":"MATCH(D28,Данные!$D:$D,0)","v":35},null,null,9,9,9,null,null,6,8,null,null,null,null,null,null,null,9,10,10,null,null,10,351,{"$f":"IF(AG28 > 0, MAX(AG$12:AG$80) / AG28, 0)","v":1.125},40,{"$f":"AE28*AF28","v":394.875},80,9,{"$f":"IF(AJ28 > 0,AI28/AJ28,0)","v":8.8888888888888893},{"$f":"MIN($I28:AD28)","v":6},null,9,17,"ОК"]
[18,"1114163","Кардаш Матвей Борисович",481548650,"447ж","Журналистика","Комм",{"$f":"MATCH(D29,Данные!$D:$D,0)","v":41},null,null,9,8,9,8,null,7,null,null,null,null,null,null,null,null,7,10,10,null,null,10,348,{"$f":"IF(AG29 > 0, MAX(AG$12:AG$80) / AG29, 0)","v":1.125},40,{"$f":"AE29*AF29","v":391.5},78,9,{"$f":"IF(AJ29 > 0,AI29/AJ29,0)","v":8.6666666666666661},{"$f":"MIN($I29:AD29)","v":7},null,9,18,"ОК"]
[19,"1104134","Рыхлик Наталья Николаевна",475519583,"445ж","Журналистика","Бюдж",{"$f":"MATCH(D30,Данные!$D:$D,0)","v":82},null,null,8,7,9,null,null,10,10,null,null,null,null,null,null,null,8,8,9,null,null,10,346,{"$f":"IF(AG30 > 0, MAX(AG$12:AG$80) / AG30, 0)","v":1.125},40,{"$f":"AE30*AF30","v":389.25},79,9,{"$f":"IF(AJ30 > 0,AI30/AJ30,0)","v":8.7777777777777786},{"$f":"MIN($I30:AD30)","v":7},null,9,19,"ОК"]
[20,"1104108","Донцова Анна Юрьевна",475525818,"447ж","Журналистика","Бюдж",{"$f":"MATCH(D31,Данные!$D:$D,0)","v":69},null,null,9,7,9,null,null,8,null,10,null,null,null,null,null,null,7,8,10,null,null,10,345,{"$f":"IF(AG31 > 0, MAX(AG$12:AG$80) / AG31, 0)","v":1.125},40,{"$f":"AE31*AF31","v":388.125},78,9,{"$f":"IF(AJ31 > 0,AI31/AJ31,0)","v":8.6666666666666661},{"$f":"MIN($I31:AD31)","v":7},null,9,20,"ОК"]
["21 - 22","1104102","Акумова Анна Дмитриевна",475523457,"447ж","Журналистика","Бюдж",{"$f":"MATCH(D32,Данные!$D:$D,0)","v":23},null,null,7,10,10,null,null,8,9,null,null,null,null,null,null,null,7,10,9,null,null,10,344,{"$f":"IF(AG32 > 0, MAX(AG$12:AG$80) / AG32, 0)","v":1.125},40,{"$f":"AE32*AF32","v":387},80,9,{"$f":"IF(AJ32 > 0,AI32/AJ32,0)","v":8.8888888888888893},{"$f":"MIN($I32:AD32)","v":7},null,9,21,"ОК"]
[null,"1114180","Самарина Евгения Олеговна",481550428,"447ж","Журналистика","Комм",{"$f":"MATCH(D33,Данные!$D:$D,0)","v":27},null,null,10,7,8,9,null,7,null,null,null,null,null,null,null,null,10,7,10,null,null,10,344,{"$f":"IF(AG33 > 0, MAX(AG$12:AG$80) / AG33, 0)","v":1.125},40,{"$f":"AE33*AF33","v":387},78,9,{"$f":"IF(AJ33 > 0,AI33/AJ33,0)","v":8.6666666666666661},{"$f":"MIN($I33:AD33)","v":7},null,9,22,"ОК"]
[23,"1104113","Ихно Дарья Сергеевна",475526751,"447ж","Журналистика","Бюдж",{"$f":"MATCH(D34,Данные!$D:$D,0)","v":71},null,null,7,8,10,null,null,9,10,null,null,null,null,null,null,null,8,8,10,null,null,10,343,{"$f":"IF(AG34 > 0, MAX(AG$12:AG$80) / AG34, 0)","v":1.125},40,{"$f":"AE34*AF34","v":385.875},80,9,{"$f":"IF(AJ34 > 0,AI34/AJ34,0)","v":8.8888888888888893},{"$f":"MIN($I34:AD34)","v":7},null,9,23,"ОК"]
[24,"1114149","Вергазова Анна Тимуровна",481546960,"447ж","Журналистика","Комм",{"$f":"MATCH(D35,Данные!$D:$D,0)","v":39},null,null,9,10,8,null,null,8,null,10,null,null,null,null,null,null,10,6,9,null,null,10,342,{"$f":"IF(AG35 > 0, MAX(AG$12:AG$80) / AG35, 0)","v":1.125},40,{"$f":"AE35*AF35","v":384.75},80,9,{"$f":"IF(AJ35 > 0,AI35/AJ35,0)","v":8.8888888888888893},{"$f":"MIN($I35:AD35)","v":6},null,9,24,"ОК"]
["25 - 26","1104114","Козырев Макар Денисович",475520112,"446ж","Журналистика","Бюдж",{"$f":"MATCH(D36,Данные!$D:$D,0)","v":16},9,null,7,10,10,null,null,6,null,null,null,null,null,null,null,null,10,10,9,null,null,10,341,{"$f":"IF(AG36 > 0, MAX(AG$12:AG$80) / AG36, 0)","v":1.125},40,{"$f":"AE36*AF36","v":383.625},81,9,{"$f":"IF(AJ36 > 0,AI36/AJ36,0)","v":9},{"$f":"MIN($I36:AD36)","v":6},null,9,25,"ОК"]
[null,"1104141","Чумакова Инга Константиновна",475530733,"447ж","Журналистика","Бюдж",{"$f":"MATCH(D37,Данные!$D:$D,0)","v":79},null,null,7,8,10,null,null,8,9,null,null,null,null,null,null,null,8,10,9,null,null,10,341,{"$f":"IF(AG37 > 0, MAX(AG$12:AG$80) / AG37, 0)","v":1.125},40,{"$f":"AE37*AF37","v":383.625},79,9,{"$f":"IF(AJ37 > 0,AI37/AJ37,0)","v":8.7777777777777786},{"$f":"MIN($I37:AD37)","v":7},null,9,26,"ОК"]
["27 - 28","1104103","Бочарова Анастасия Денисовна",475524374,"447ж","Журналистика","Бюдж",{"$f":"MATCH(D38,Данные!$D:$D,0)","v":67},null,null,8,7,9,null,null,8,null,9,null,null,null,null,null,null,7,9,10,null,null,10,339,{"$f":"IF(AG38 > 0, MAX(AG$12:AG$80) / AG38, 0)","v":1.125},40,{"$f":"AE38*AF38","v":381.375},77,9,{"$f":"IF(AJ38 > 0,AI38/AJ38,0)","v":8.5555555555555554},{"$f":"MIN($I38:AD38)","v":7},null,9,27,"ОК"]
[null,"1104129","Полибенцева Анна Владимировна",475521694,"446ж","Журналистика","Бюдж",{"$f":"MATCH(D39,Данные!$D:$D,0)","v":87},null,null,9,8,9,null,null,8,8,null,null,null,null,null,null,null,8,7,10,null,null,10,339,{"$f":"IF(AG39 > 0, MAX(AG$12:AG$80) / AG39, 0)","v":1.125},40,{"$f":"AE39*AF39","v":381.375},77,9,{"$f":"IF(AJ39 > 0,AI39/AJ39,0)","v":8.5555555555555554},{"$f":"MIN($I39:AD39)","v":7},null,9,28,"ОК"]
["29 - 30","1104116","Кудряшова Юлия Ивановна",475527601,"447ж","Журналистика","Бюдж",{"$f":"MATCH(D40,Данные!$D:$D,0)","v":73},null,null,8,7,8,null,null,7,null,10,null,null,null,null,null,null,9,9,10,null,null,10,338,{"$f":"IF(AG40 > 0, MAX(AG$12:AG$80) / AG40, 0)","v":1.125},40,{"$f":"AE40*AF40","v":380.25},78,9,{"$f":"IF(AJ40 > 0,AI40/AJ40,0)","v":8.6666666666666661},{"$f":"MIN($I40:AD40)","v":7},null,9,29,"ОК"]
{"$rows_left_out":41}
{"sheet":"Данные","index":1,"n_rows":629,"n_cols":23,"rows_kept":629,"cut":false,"hidden":true,"merged":[]}
["ID","Оценка из 10 баллов до пересдач","Группа","Студент","Фамилия","Имя","Отчество","Номер студенческого билета","Строка учебного плана","Текущих кредитов за испытание","Вид испытания","Календарный период по плану","Неявка до пересдач","В текущий рейтинг","Текущих кредитов для студента","Оценка зачет/незачет до пересдач","Является бюджетным","Учебный план","Вид записи РУП","Вид записи ИУП","Номер Row"]
[1,2,3,4,5,6,7,8,9,10,11,12,13,14,15,16,17,18,19,20,21]
[565790801,10,"447ж",475529718,"Фалькон","Анастасия","Александровна","1104139","Государственная информационная политика",3,"Экзамен","2014/2015 учебный год 3 модуль",null,30,3,1,1,414659754,2098,null,"stChoosen","Журналистика",{"$f":"MATCH(D3,Отчет!$D:$D,0)","v":21}]
[565790781,10,"447ж",475523923,"Асангулова","Рахат","Талантбековна","1114192","Государственная информационная политика",3,"Экзамен","2014/2015 учебный год 3 модуль",null,30,3,1,1,414659754,2098,null,"stChoosen","Журналистика",{"$f":"MATCH(D4,Отчет!$D:$D,0)","v":56}]
[565790773,9,"446ж",481542689,"Реутова","Полина","Сергеевна","1114175","Государственная информационная политика",3,"Экзамен","2014/2015 учебный год 3 модуль",null,27,3,1,0,414659754,2098,null,"stChoosen","Журналистика",{"$f":"MATCH(D5,Отчет!$D:$D,0)","v":44}]
[716901653,9,"445ж",481532512,"Гудова","Юлия","Викторовна","11102454","Государственная информационная политика",3,"Экзамен","2014/2015 учебный год 3 модуль",null,27,3,1,0,414659754,2098,null,"stChoosen","Журналистика",{"$f":"MATCH(D6,Отчет!$D:$D,0)","v":64}]
[565790745,10,"445ж",481532910,"Данилова","Анастасия","Андреевна","1104107","Государственная информационная политика",3,"Экзамен","2014/2015 учебный год 3 модуль",null,30,3,1,0,414659754,2098,null,"stChoosen","Журналистика",{"$f":"MATCH(D7,Отчет!$D:$D,0)","v":26}]
[565790749,6,"445ж",481533939,"Заикина","Полина","Никитична","1114159","Государственная информационная политика",3,"Экзамен","2014/2015 учебный год 3 модуль",null,18,3,1,0,414659754,2098,null,"stChoosen","Журналистика",{"$f":"MATCH(D8,Отчет!$D:$D,0)","v":74}]
[716219712,9,"445ж",475518127,"Дюкарева","Мария","Юрьевна","1104109","Государственная информационная политика",3,"Экзамен","2014/2015 учебный год 3 модуль",null,27,3,1,1,414659754,2098,null,"stChoosen","Журналистика",{"$f":"MATCH(D9,Отчет!$D:$D,0)","v":43}]
[565790741,5,"445ж",475578675,"Голиков","Александр","Вячеславович","1114154","Государственная информационная политика",3,"Экзамен","2014/2015 учебный год 3 модуль",null,15,3,1,0,414659754,2098,null,"stChoosen","Журналистика",{"$f":"MATCH(D10,Отчет!$D:$D,0)","v":77}]
[565790753,7,"445ж",475579737,"Казокина","Александра","Сергеевна","1114161","Государственная информационная политика",3,"Экзамен","2014/2015 учебный год 3 модуль",null,21,3,1,0,414659754,2098,"ikPlanned","stChoosen","Журналистика",{"$f":"MATCH(D11,Отчет!$D:$D,0)","v":75}]
[565790761,7,"446ж",475581664,"Васильева","Анастасия","Руслановна","1114148","Государственная информационная политика",3,"Экзамен","2014/2015 учебный год 3 модуль",null,21,3,1,0,414659754,2098,null,"stChoosen","Журналистика",{"$f":"MATCH(D12,Отчет!$D:$D,0)","v":79}]
[565790793,10,"447ж",475583224,"Мухаметдинова","Элина","Шамилевна","1104123","Государственная информационная политика",3,"Экзамен","2014/2015 учебный год 3 модуль",null,30,3,1,1,414659754,2098,null,"stChoosen","Журналистика",{"$f":"MATCH(D13,Отчет!$D:$D,0)","v":25}]
[565790797,10,"447ж",475529260,"Разумовская","Мария","Алексеевна","1104132","Государственная информационная политика",3,"Экзамен","2014/2015 учебный год 3 модуль",null,30,3,1,1,414659754,2098,null,"stChoosen","Журналистика",{"$f":"MATCH(D14,Отчет!$D:$D,0)","v":15}]
[565790757,10,"445ж",475519046,"Латынин","Антон","Валерьевич","1114166","Государственная информационная политика",3,"Экзамен","2014/2015 учебный год 3 модуль",null,30,3,1,1,414659754,2098,null,"stChoosen","Журналистика",{"$f":"MATCH(D15,Отчет!$D:$D,0)","v":54}]
[565790765,9,"446ж",475520112,"Козырев","Макар","Денисович","1104114","Государственная информационная политика",3,"Экзамен","2014/2015 учебный год 3 модуль",null,27,3,1,1,414659754,2098,null,"stChoosen","Журналистика",{"$f":"MATCH(D16,Отчет!$D:$D,0)","v":36}]
[565790777,8,"446ж",475522503,"Шанталова","Александра","Спартаковна","1104142","Государственная информационная политика",3,"Экзамен","2014/2015 учебный год 3 модуль",null,24,3,1,1,414659754,2098,null,"stChoosen","Журналистика",{"$f":"MATCH(D17,Отчет!$D:$D,0)","v":69}]
[720412090,8,"446ж",481541627,"Мозжерова","Анна","Сергеевна","1114172","Государственная информационная политика",3,"Экзамен","2014/2015 учебный год 3 модуль",null,24,3,1,0,414659754,2098,null,"stChoosen","Журналистика",{"$f":"MATCH(D18,Отчет!$D:$D,0)","v":52}]
[974757126,4,"446ж",972492801,"Белодедова","Маргарита","Геннадьевна","2804108","Деловая журналистика",5.5,"Экзамен","2014/2015 учебный год 3 модуль",null,22,5.5,1,0,414659754,2098,"ikPassed","stCommon","Журналистика",{"$f":"MATCH(D19,Отчет!$D:$D,0)","v":80}]
[508262038,9,"446ж",475522118,"Понтус","Юлия","Игоревна","1104131","Деловая журналистика",9,"Экзамен","2014/2015 учебный год 3 модуль",null,81,9,1,1,414659754,2098,null,"stCommon","Журналистика",{"$f":"MATCH(D20,Отчет!$D:$D,0)","v":41}]
[508262145,6,"446ж",475522503,"Шанталова","Александра","Спартаковна","1104142","Деловая журналистика",9,"Экзамен","2014/2015 учебный год 3 модуль",null,54,9,1,1,414659754,2098,null,"stCommon","Журналистика",{"$f":"MATCH(D21,Отчет!$D:$D,0)","v":69}]
[508263559,9,"447ж",475522967,"Агрызкова","Юлия","Игоревна","1104101","Деловая журналистика",9,"Экзамен","2014/2015 учебный год 3 модуль",null,81,9,1,1,414659754,2098,null,"stCommon","Журналистика",{"$f":"MATCH(D22,Отчет!$D:$D,0)","v":14}]
[508267705,7,"447ж",475523457,"Акумова","Анна","Дмитриевна","1104102","Деловая журналистика",9,"Экзамен","2014/2015 учебный год 3 модуль",null,63,9,1,1,414659754,2098,null,"stCommon","Журналистика",{"$f":"MATCH(D23,Отчет!$D:$D,0)","v":32}]
[508263778,7,"447ж",475523923,"Асангулова","Рахат","Талантбековна","1114192","Деловая журналистика",9,"Экзамен","2014/2015 учебный год 3 модуль",null,63,9,1,1,414659754,2098,null,"stCommon","Журналистика",{"$f":"MATCH(D24,Отчет!$D:$D,0)","v":56}]
[508266906,4,"447ж",481549226,"Милушкова","Полина","Юрьевна","1114170","Деловая журналистика",9,"Экзамен","2014/2015 учебный год 3 модуль",null,36,9,1,0,414659754,2098,null,"stCommon","Журналистика",{"$f":"MATCH(D25,Отчет!$D:$D,0)","v":68}]
[508267089,9,"447ж",481549768,"Мирошкина","Дарья","Александровна","1114171","Деловая журналистика",9,"Экзамен","2014/2015 учебный год 3 модуль",null,81,9,1,0,414659754,2098,null,"stCommon","Журналистика",{"$f":"MATCH(D26,Отчет!$D:$D,0)","v":53}]
[508267218,10,"447ж",481550428,"Самарина","Евгения","Олеговна","1114180","Деловая журналистика",9,"Экзамен","2014/2015 учебный год 3 модуль",null,90,9,1,0,414659754,2098,null,"stCommon","Журналистика",{"$f":"MATCH(D27,Отчет!$D:$D,0)","v":33}]
[508264950,9,"447ж",475529718,"Фалькон","Анастасия","Александровна","1104139","Деловая журналистика",9,"Экзамен","2014/2015 учебный год 3 модуль",null,81,9,1,1,414659754,2098,null,"stCommon","Журналистика",{"$f":"MATCH(D28,Отчет!$D:$D,0)","v":21}]
[508262501,6,"446ж",481541119,"Мальцева","Елизавета","Олеговна","1114168","Деловая журналистика",9,"Экзамен","2014/2015 учебный год 3 модуль",null,54,9,1,0,414659754,2098,null,"stCommon","Журналистика",{"$f":"MATCH(D29,Отчет!$D:$D,0)","v":58}]
[508262686,7,"446ж",481541627,"Мозжерова","Анна","Сергеевна","1114172","Деловая журналистика",9,"Экзамен","2014/2015 учебный год 3 модуль",null,63,9,1,0,414659754,2098,null,"stCommon","Журналистика",{"$f":"MATCH(D30,Отчет!$D:$D,0)","v":52}]
[508262813,7,"446ж",481542172,"Николаева","Ирина","Александровна","10151075","Деловая журналистика",9,"Экзамен","2014/2015 учебный год 3 модуль",null,63,9,1,0,414659754,2098,"ikPlanned","stCommon","Журналистика",{"$f":"MATCH(D31,Отчет!$D:$D,0)","v":67}]
[508262917,8,"446ж",481542689,"Реутова","Полина","Сергеевна","1114175","Деловая журналистика",9,"Экзамен","2014/2015 учебный год 3 модуль",null,72,9,1,0,414659754,2098,null,"stCommon","Журналистика",{"$f":"MATCH(D32,Отчет!$D:$D,0)","v":44}]
[508263017,9,"446ж",481543173,"Романова","Юлия","Владимировна","1114176","Деловая журналистика",9,"Экзамен","2014/2015 учебный год 3 модуль",null,81,9,1,0,414659754,2098,null,"stCommon","Журналистика",{"$f":"MATCH(D33,Отчет!$D:$D,0)","v":23}]
[508263127,8,"446ж",481543686,"Ткачук","Анфиса","Сергеевна","1114185","Деловая журналистика",9,"Экзамен","2014/2015 учебный год 3 модуль",null,72,9,1,1,414659754,2098,null,"stCommon","Журналистика",{"$f":"MATCH(D34,Отчет!$D:$D,0)","v":19}]
[508263232,9,"446ж",481544213,"Федотова","Елена","Андреевна","1114186","Деловая журналистика",9,"Экзамен","2014/2015 учебный год 3 модуль",null,81,9,1,0,414659754,2098,null,"stCommon","Журналистика",{"$f":"MATCH(D35,Отчет!$D:$D,0)","v":28}]
[508265571,8,"447ж",481545222,"Асекритова","Екатерина","Александровна","1114145","Деловая журналистика",9,"Экзамен","2014/2015 учебный год 3 модуль",null,72,9,1,0,414659754,2098,null,"stCommon","Журналистика",{"$f":"MATCH(D36,Отчет!$D:$D,0)","v":48}]
[508265803,9,"447ж",481545758,"Бабаянц","Виолетта","Владимировна","1114146","Деловая журналистика",9,"Экзамен","2014/2015 учебный год 3 модуль",null,81,9,1,0,414659754,2098,null,"stCommon","Журналистика",{"$f":"MATCH(D37,Отчет!$D:$D,0)","v":18}]
[508266029,10,"447ж",481546380,"Василиади","Елена","Христоевна","1004107","Деловая журналистика",9,"Экзамен","2014/2015 учебный год 3 модуль",null,90,9,1,0,414659754,2098,null,"stCommon","Журналистика",{"$f":"MATCH(D38,Отчет!$D:$D,0)","v":22}]
[508266275,9,"447ж",481546960,"Вергазова","Анна","Тимуровна","1114149","Деловая журналистика",9,"Экзамен","2014/2015 учебный год 3 модуль",null,81,9,1,0,414659754,2098,null,"stCommon","Журналистика",{"$f":"MATCH(D39,Отчет!$D:$D,0)","v":35}]
[508266503,6,"447ж",481548074,"Игнатчук","Ольга","Ивановна","1114160","Деловая журналистика",9,"Экзамен","2014/2015 учебный год 3 модуль",null,54,9,1,0,414659754,2098,null,"stCommon","Журналистика",{"$f":"MATCH(D40,Отчет!$D:$D,0)","v":73}]
{"$rows_left_out":589}