{"text_format":"1","workbook":"xlsx","n_sheets":2,"sheets":["Отчет","Данные"],"not_rendered":{"charts":0,"images":1,"macros":1,"external_links":0,"defined_names":0,"comments":0,"pivot_tables":0},"unopened":[],"bounds":{"document_bytes":16777216,"sheet_cells":100000,"rows_first":2000,"rows_last":500,"rows_between":2000,"halvings":0,"cell_chars":16384,"cell_head_chars":4096},"cells_cut":0,"cells_raw":0,"read":"whole","date_system":"1900"}

{"sheet":"Отчет","index":0,"n_rows":110,"n_cols":58,"rows_kept":110,"cut":false,"hidden":false,"merged":[[17,0,18,0],[7,1,9,1],[7,5,7,11],[8,5,8,11],[8,12,8,39],[7,12,7,45],[8,40,8,45],[7,50,10,50],[7,0,9,0],[1,52,2,55],[0,52,0,55],[7,53,10,53],[7,51,10,51],[7,2,9,2],[7,3,9,3],[7,56,10,56],[10,0,10,3],[7,55,10,55],[7,46,10,46],[7,49,10,49],[7,52,10,52],[7,47,10,47],[7,54,10,54],[7,48,10,48]]}
["Текущий рейтинг студентов (до пересдач)",null,null,null,null,null,null,null,null,null,null,null,null,null,null,null,null,null,null,null,null,null,null,null,null,null,null,null,null,null,null,null,null,null,null,null,null,null,null,null,null,null,null,null,null,null,null,null,null,null,null,null,"Приложение 3"]
["Дата выгрузки: 20.07.2015",null,null,null,null,null,null,null,null,null,null,null,null,null,null,null,null,null,null,null,null,null,null,null,null,null,null,null,null,null,null,null,null,null,null,null,null,null,null,null,null,null,null,null,null,null,null,null,null,null,null,null,"к Положению о рейтинговой системе комплексной оценки знаний студентов "]
["Период: c 2014/2015 учебный год II семестр по 2014/2015 учебный год II семестр"]
["Факультет/отделение: Факультет коммуникаций, медиа и дизайна"]
["Направление  подготовки: Направление \"Журналистика\""]
["Уровень образования, номер курса: Бакалавриат 2 курс",null,null,null,null,null," - студенты имеющие задолженности"]
[null,null,null,null,null,"*"," - изучение по ИУП"]
["Место","Студент","ID","Образовательная программа студента",null,"2014/2015 учебный год 3 модуль",null,null,null,null,null,null,"2014/2015 учебный год 4 модуль",null,null,null,null,null,null,null,null,null,null,null,null,null,null,null,null,null,null,null,null,null,null,null,null,null,null,null,null,null,null,null,null,null,"Кредитно-рейтинговая оценка","Нормировочный коэффициент","Сумма всех кредитов ","Нормированная кредитно-рейтинговая оценка","Сумма всех оценок","Количество всех оценок","Средний балл","Минимальный балл","Наличие неудовлетворительных оценок и неявок","Количество удовлетворительных оценок","Номер места"]
[null,null,null,null,null,"Экзамен",null,null,null,null,null,null,"Экзамен",null,null,null,null,null,null,null,null,null,null,null,null,null,null,null,null,null,null,null,null,null,null,null,null,null,null,null,"Зачет"]
[null,null,null,null,"Номер Row","Иностранный язык (английский)","Иностранный язык (английский)","Иностранный язык (английский)","Мегаполисы мира","Психология (включая основы социальной психологии)","Создание Интернет-проектов. Уровень 2. Язык CSS","Создание Интернет-проектов. Уровень 3. Основы языка программирования JavaScript","«Мягкая сила» и «управляемый хаос» - инструменты современной мировой политики","Визуальная информация и визуализация данных","Европейская музыка от античности до XXI века: исторические этюды","Земное и внеземное: космос в науке, мифологии, искусстве и политике","Иностранный язык (немецкий)","Иностранный язык (немецкий)","Иностранный язык (французский)","Иностранный язык (французский)","Иностранный язык (французский)","Исследование медиа-процессов","Исследование медиа-процессов","История","История","История и теория литературы","История и теория литературы","Курсовая работа","Основы операторской и режиссерской культуры для тележурналистов","Психология (включая основы социальной психологии)","Психология (включая основы социальной психологии)","Современные телевизионные форматы","Создание Интернет-проектов. Уровень 4. Основы языка программирования PHP","Теория и практика русского литературного языка","Теория и практика русского литературного языка","Техника речи","Техника речи","Технологии манипулирования в СМИ: выявление, анализ, противодействие","Технология работы журналиста (платформы)","Язык и политика","История и теория литературы","Теория и практика русского литературного языка","Физическая культура","Физическая культура","Физическая культура","Язык и политика"]
["Число текущих кредитов:",null,null,null,null,1.92,3,5,0,3,0,0,0,4.5,0,0,0,5,0,5,6,1.67,1.96,3.6,7,3.72,4.03,5,3,3,6,3,0,3,4,0,5,3,4.78,3,3.31,3,0,0.25,0.28000000000000003,1.5]
[1,"Правдюк Анна Сергеевна",481500535,"Журналистика",{"$f":"MATCH(C12,Данные!$D:$D,0)","v":93},10,null,null,10,10,null,null,null,null,null,null,10,null,null,null,null,10,null,10,null,10,null,10,null,10,null,10,null,10,null,null,null,null,9,null,null,null,10,null,null,null,322.12,{"$f":"IF(AW12 > 0, MAX(AW$12:AW$110) / AW12, 0)","v":1.3144692566534109},32.69,{"$f":"AU12*AV12","v":423.41683695319671},129,13,{"$f":"IF(AZ12 > 0,AY12/AZ12,0)","v":9.9230769230769234},{"$f":"MIN($F12:AT12)","v":9},null,13,1,"ОК"]
[2,"Суханова Юлия Александровна",475503448,"Журналистика",{"$f":"MATCH(C13,Данные!$D:$D,0)","v":35},9,null,null,null,9,null,null,null,null,null,null,9,null,null,null,null,9,null,9,null,10,null,10,null,10,null,null,null,10,null,9,null,10,10,null,null,null,10,null,null,null,316.71000000000004,{"$f":"IF(AW13 > 0, MAX(AW$12:AW$110) / AW13, 0)","v":1.3144692566534109},32.69,{"$f":"AU13*AV13","v":416.30555827470181},124,13,{"$f":"IF(AZ13 > 0,AY13/AZ13,0)","v":9.5384615384615383},{"$f":"MIN($F13:AT13)","v":9},null,13,2,"ОК"]
[3,"Королева Ольга Викторовна",481504458,"Журналистика",{"$f":"MATCH(C14,Данные!$D:$D,0)","v":39},9,null,null,null,9,8,9,null,null,null,null,10,null,null,null,null,9,null,9,null,10,null,10,null,10,null,9,9,10,null,8,null,null,10,null,null,null,10,null,null,null,313.71000000000004,{"$f":"IF(AW14 > 0, MAX(AW$12:AW$110) / AW14, 0)","v":1.3144692566534109},32.69,{"$f":"AU14*AV14","v":412.36215050474158},149,16,{"$f":"IF(AZ14 > 0,AY14/AZ14,0)","v":9.3125},{"$f":"MIN($F14:AT14)","v":8},null,16,3,"ОК"]
[4,"Лебедева Ксения Кирилловна",481500039,"Журналистика",{"$f":"MATCH(C15,Данные!$D:$D,0)","v":90},10,null,null,null,9,null,null,null,null,null,null,null,null,9,null,null,9,null,10,null,10,null,9,null,10,null,10,null,10,null,null,null,null,9,null,null,null,10,null,null,null,312.45,{"$f":"IF(AW15 > 0, MAX(AW$12:AW$110) / AW15, 0)","v":1.3144692566534109},32.69,{"$f":"AU15*AV15","v":410.70591924135823},115,12,{"$f":"IF(AZ15 > 0,AY15/AZ15,0)","v":9.5833333333333339},{"$f":"MIN($F15:AT15)","v":9},null,12,4,"ОК"]
[5,"Королькова Елизавета Дмитриевна",481499652,"Журналистика",{"$f":"MATCH(C16,Данные!$D:$D,0)","v":89},9,null,null,null,9,null,null,null,null,null,null,7,null,null,null,null,9,null,10,null,10,null,10,null,10,null,9,null,9,null,9,null,null,9,null,null,null,10,null,null,null,309.52999999999997,{"$f":"IF(AW16 > 0, MAX(AW$12:AW$110) / AW16, 0)","v":1.3144692566534109},32.69,{"$f":"AU16*AV16","v":406.86766901193022},120,13,{"$f":"IF(AZ16 > 0,AY16/AZ16,0)","v":9.2307692307692299},{"$f":"MIN($F16:AT16)","v":7},null,13,5,"ОК"]
[6,"Скворцова Дарья Андреевна",475498901,"Журналистика",{"$f":"MATCH(C17,Данные!$D:$D,0)","v":65},9,null,null,null,9,null,null,null,null,null,null,9,null,null,null,null,10,null,9,null,10,null,10,9,10,null,null,null,9,null,8,null,null,9,null,null,null,10,null,null,null,307.59999999999997,{"$f":"IF(AW17 > 0, MAX(AW$12:AW$110) / AW17, 0)","v":1.3144692566534109},32.69,{"$f":"AU17*AV17","v":404.33074334658914},121,13,{"$f":"IF(AZ17 > 0,AY17/AZ17,0)","v":9.3076923076923084},{"$f":"MIN($F17:AT17)","v":8},null,13,6,"ОК"]
["7 - 8","Кокорева Мария Викторовна",481504306,"Журналистика",{"$f":"MATCH(C18,Данные!$D:$D,0)","v":38},9,null,null,null,9,null,null,null,null,null,null,null,null,null,null,null,9,null,9,null,10,null,8,null,10,null,null,null,10,null,null,null,10,10,null,null,null,10,null,null,null,306.71000000000004,{"$f":"IF(AW18 > 0, MAX(AW$12:AW$110) / AW18, 0)","v":1.3144692566534109},32.69,{"$f":"AU18*AV18","v":403.16086570816771},104,11,{"$f":"IF(AZ18 > 0,AY18/AZ18,0)","v":9.454545454545455},{"$f":"MIN($F18:AT18)","v":8},null,11,7,"ОК"]
[null,"Савина София Леонидовна",481505031,"Журналистика",{"$f":"MATCH(C19,Данные!$D:$D,0)","v":47},9,null,null,null,9,null,null,null,null,null,null,9,null,9,null,null,9,null,9,null,10,null,8,null,10,null,null,null,10,null,8,null,10,10,null,null,null,10,null,null,null,306.71000000000004,{"$f":"IF(AW19 > 0, MAX(AW$12:AW$110) / AW19, 0)","v":1.3144692566534109},32.69,{"$f":"AU19*AV19","v":403.16086570816771},130,14,{"$f":"IF(AZ19 > 0,AY19/AZ19,0)","v":9.2857142857142865},{"$f":"MIN($F19:AT19)","v":8},null,14,8,"ОК"]
[9,"Липчанская Анастасия Алексеевна",475501239,"Журналистика",{"$f":"MATCH(C20,Данные!$D:$D,0)","v":12},9,null,null,null,10,null,null,null,null,null,null,null,null,null,null,null,10,null,8,null,10,null,10,null,10,null,9,null,10,null,9,null,null,8,null,null,null,10,null,null,null,305.22000000000003,{"$f":"IF(AW20 > 0, MAX(AW$12:AW$110) / AW20, 0)","v":1.3144692566534109},32.69,{"$f":"AU20*AV20","v":401.20230651575412},113,12,{"$f":"IF(AZ20 > 0,AY20/AZ20,0)","v":9.4166666666666661},{"$f":"MIN($F20:AT20)","v":8},null,12,9,"ОК"]
[10,"Рудакова Юлия Владиславовна",475498778,"Журналистика",{"$f":"MATCH(C21,Данные!$D:$D,0)","v":64},9,null,null,null,9,null,null,null,null,null,null,9,null,null,null,null,10,null,9,null,10,null,10,9,10,null,null,null,8,null,8,null,null,9,null,null,null,10,null,null,null,304.59999999999997,{"$f":"IF(AW21 > 0, MAX(AW$12:AW$110) / AW21, 0)","v":1.3144692566534109},32.69,{"$f":"AU21*AV21","v":400.38733557662891},120,13,{"$f":"IF(AZ21 > 0,AY21/AZ21,0)","v":9.2307692307692299},{"$f":"MIN($F21:AT21)","v":8},null,13,10,"ОК"]
[11,"Морозова Николь Дмитриевна",481497225,"Журналистика",{"$f":"MATCH(C22,Данные!$D:$D,0)","v":83},9,null,null,null,9,null,null,null,null,9,null,9,null,null,null,null,9,null,8,null,9,null,10,10,9,null,null,null,10,null,10,null,null,9,null,null,null,10,null,null,null,301.61,{"$f":"IF(AW22 > 0, MAX(AW$12:AW$110) / AW22, 0)","v":1.3144692566534109},32.69,{"$f":"AU22*AV22","v":396.45707249923527},130,14,{"$f":"IF(AZ22 > 0,AY22/AZ22,0)","v":9.2857142857142865},{"$f":"MIN($F22:AT22)","v":8},null,14,11,"ОК"]
[12,"Ревоненко Анна Николаевна",481500688,"Журналистика",{"$f":"MATCH(C23,Данные!$D:$D,0)","v":94},9,null,null,null,9,null,null,null,null,null,null,null,null,9,null,null,8,null,8,null,10,null,10,null,9,null,null,null,9,null,10,null,8,10,null,null,null,10,null,null,null,299.44,{"$f":"IF(AW23 > 0, MAX(AW$12:AW$110) / AW23, 0)","v":1.3144692566534109},32.69,{"$f":"AU23*AV23","v":393.60467421229737},119,13,{"$f":"IF(AZ23 > 0,AY23/AZ23,0)","v":9.1538461538461533},{"$f":"MIN($F23:AT23)","v":8},null,13,12,"ОК"]
[13,"Чернова Кристина Валериевна",475501776,"Журналистика",{"$f":"MATCH(C24,Данные!$D:$D,0)","v":16},9,null,null,null,8,null,null,null,null,9,null,8,null,9,null,null,9,null,8,null,10,null,10,null,8,null,8,null,10,null,null,null,8,10,null,null,null,10,null,null,null,298.11,{"$f":"IF(AW24 > 0, MAX(AW$12:AW$110) / AW24, 0)","v":1.3144692566534109},32.69,{"$f":"AU24*AV24","v":391.85643010094833},134,15,{"$f":"IF(AZ24 > 0,AY24/AZ24,0)","v":8.9333333333333336},{"$f":"MIN($F24:AT24)","v":8},null,15,13,"ОК"]
[14,"Рублева Милена Валерьевна",475501513,"Журналистика",{"$f":"MATCH(C25,Данные!$D:$D,0)","v":14},10,null,null,null,9,null,null,null,null,null,null,null,null,10,null,null,9,null,9,null,10,null,10,null,8,null,null,null,10,null,8,null,8,8,null,null,null,10,null,null,null,297.07,{"$f":"IF(AW25 > 0, MAX(AW$12:AW$110) / AW25, 0)","v":1.3144692566534109},32.69,{"$f":"AU25*AV25","v":390.48938207402875},119,13,{"$f":"IF(AZ25 > 0,AY25/AZ25,0)","v":9.1538461538461533},{"$f":"MIN($F25:AT25)","v":8},null,13,14,"ОК"]
[15,"Мусина Юлия Маратовна",475563331,"Журналистика",{"$f":"MATCH(C26,Данные!$D:$D,0)","v":63},9,null,null,null,9,null,null,null,null,null,null,null,null,9,null,null,9,null,8,null,8,null,10,10,9,null,null,null,8,null,9,null,null,10,null,null,null,10,null,null,null,296.67,{"$f":"IF(AW26 > 0, MAX(AW$12:AW$110) / AW26, 0)","v":1.3144692566534109},32.69,{"$f":"AU26*AV26","v":389.96359437136744},118,13,{"$f":"IF(AZ26 > 0,AY26/AZ26,0)","v":9.0769230769230766},{"$f":"MIN($F26:AT26)","v":8},null,13,15,"ОК"]
[16,"Яковец Елизавета Николаевна",475497867,"Журналистика",{"$f":"MATCH(C27,Данные!$D:$D,0)","v":75},9,null,null,null,7,null,null,null,null,null,null,null,null,null,null,null,9,null,9,null,9,null,10,null,10,null,8,null,10,null,7,null,null,9,null,null,null,10,null,null,null,296.20999999999998,{"$f":"IF(AW27 > 0, MAX(AW$12:AW$110) / AW27, 0)","v":1.3144692566534109},32.69,{"$f":"AU27*AV27","v":389.35893851330678},107,12,{"$f":"IF(AZ27 > 0,AY27/AZ27,0)","v":8.9166666666666661},{"$f":"MIN($F27:AT27)","v":7},null,12,16,"ОК"]
[17,"Герасимова Мария Александровна",475562579,"Журналистика",{"$f":"MATCH(C28,Данные!$D:$D,0)","v":59},9,null,null,null,10,null,null,null,null,null,null,null,null,null,null,null,9,null,9,null,9,null,10,null,8,null,null,null,9,null,null,null,9,8,null,null,null,10,null,null,null,294.43,{"$f":"IF(AW28 > 0, MAX(AW$12:AW$110) / AW28, 0)","v":1.3144692566534109},32.69,{"$f":"AU28*AV28","v":387.01918323646379},100,11,{"$f":"IF(AZ28 > 0,AY28/AZ28,0)","v":9.0909090909090917},{"$f":"MIN($F28:AT28)","v":8},null,11,17,"ОК"]
[18,"Николаева Мария Дмитриевна",475497479,"Журналистика",{"$f":"MATCH(C29,Данные!$D:$D,0)","v":72},9,null,null,null,7,null,null,null,null,null,null,9,null,null,null,null,9,null,8,null,9,null,10,null,8,null,10,null,10,null,null,null,null,9,null,null,null,10,null,null,null,292.61,{"$f":"IF(AW29 > 0, MAX(AW$12:AW$110) / AW29, 0)","v":1.3144692566534109},32.69,{"$f":"AU29*AV29","v":384.62684918935457},108,12,{"$f":"IF(AZ29 > 0,AY29/AZ29,0)","v":9},{"$f":"MIN($F29:AT29)","v":7},null,12,18,"ОК"]
[19,"Федорова Анастасия Александровна",475499056,"Журналистика",{"$f":"MATCH(C30,Данные!$D:$D,0)","v":66},9,null,null,null,9,null,null,null,null,null,null,null,null,8,null,null,10,null,8,null,9,null,9,null,10,null,9,null,8,null,7,null,null,9,null,null,null,10,null,null,null,292.27999999999997,{"$f":"IF(AW30 > 0, MAX(AW$12:AW$110) / AW30, 0)","v":1.3144692566534109},32.69,{"$f":"AU30*AV30","v":384.19307433465889},115,13,{"$f":"IF(AZ30 > 0,AY30/AZ30,0)","v":8.8461538461538467},{"$f":"MIN($F30:AT30)","v":7},null,13,19,"ОК"]
{"$rows_left_out":81}
{"sheet":"Данные","index":1,"n_rows":1231,"n_cols":23,"rows_kept":1231,"cut":false,"hidden":true,"merged":[]}
["ID","Оценка из 10 баллов до пересдач","Группа","Студент","Фамилия","Имя","Отчество","Номер студенческого билета","Строка учебного плана","Текущих кредитов за испытание","Вид испытания","Календарный период по плану","Неявка до пересдач","В текущий рейтинг","Текущих кредитов для студента","Оценка зачет/незачет до пересдач","Является бюджетным","Учебный план","Вид записи РУП","Вид записи ИУП","Номер Row"]
[1,2,3,4,5,6,7,8,9,10,11,12,13,14,15,16,17,18,19,20,21]
[771504574,7,"БЖУР131",752764364,"Масалова","Анна","Владиславовна","131232133","Иностранный язык (английский)",1.92,"Экзамен","2014/2015 учебный год 3 модуль",null,13.44,1.92,1,0,508316804,2098,"ikPlanned","stCommon","Журналистика",{"$f":"MATCH(D3,Отчет!$C:$C,0)","v":92}]
[617795941,9,"БЖУР131",615125946,"Халилова","Арзу","Идаятовна","131232230","Иностранный язык (английский)",1.92,"Экзамен","2014/2015 учебный год 3 модуль",null,17.28,1.92,1,0,508316804,2098,"ikPlanned","stCommon","Журналистика",{"$f":"MATCH(D4,Отчет!$C:$C,0)","v":95}]
[796966708,4,"БЖУР131",796834861,"Тесфайе","Анна-Мария","Синтайе","10701175","Иностранный язык (английский)",1.92,"Экзамен","2014/2015 учебный год 3 модуль",null,7.68,1.92,1,0,508316804,2098,"ikPlanned","stCommon","Журналистика",{"$f":"MATCH(D5,Отчет!$C:$C,0)","v":109}]
[525601346,8,"БЖУР132",475499320,"Якубович","Анастасия","Александровна","1301219108","Иностранный язык (английский)",1.92,"Экзамен","2014/2015 учебный год 3 модуль",null,15.36,1.92,1,1,508316804,2098,null,"stCommon","Журналистика",{"$f":"MATCH(D6,Отчет!$C:$C,0)","v":63}]
[525601830,9,"БЖУР133",475500480,"Вильшанская","Елена","Андреевна","1301219017","Иностранный язык (английский)",1.92,"Экзамен","2014/2015 учебный год 3 модуль",null,17.28,1.92,1,1,508316804,2098,null,"stCommon","Журналистика",{"$f":"MATCH(D7,Отчет!$C:$C,0)","v":31}]
[525601962,9,"БЖУР133",475500628,"Головина","Евгения","Павловна","1301219023","Иностранный язык (английский)",1.92,"Экзамен","2014/2015 учебный год 3 модуль",null,17.28,1.92,1,1,508316804,2098,null,"stCommon","Журналистика",{"$f":"MATCH(D8,Отчет!$C:$C,0)","v":41}]
[525602028,9,"БЖУР133",475500772,"Дмитриева","Екатерина","Александровна","1301219030","Иностранный язык (английский)",1.92,"Экзамен","2014/2015 учебный год 3 модуль",null,17.28,1.92,1,1,508316804,2098,null,"stCommon","Журналистика",{"$f":"MATCH(D9,Отчет!$C:$C,0)","v":40}]
[525602097,7,"БЖУР133",475500939,"Еремина","Анастасия","Алексеевна","1301219033","Иностранный язык (английский)",1.92,"Экзамен","2014/2015 учебный год 3 модуль",null,13.44,1.92,1,1,508316804,2098,null,"stCommon","Журналистика",{"$f":"MATCH(D10,Отчет!$C:$C,0)","v":94}]
[525602259,8,"БЖУР133",475501085,"Кокшарова","Александра","Игоревна","1301219041","Иностранный язык (английский)",1.92,"Экзамен","2014/2015 учебный год 3 модуль",null,15.36,1.92,1,1,508316804,2098,null,"stCommon","Журналистика",{"$f":"MATCH(D11,Отчет!$C:$C,0)","v":48}]
[525602327,9,"БЖУР133",475501239,"Липчанская","Анастасия","Алексеевна","1301219049","Иностранный язык (английский)",1.92,"Экзамен","2014/2015 учебный год 3 модуль",null,17.28,1.92,1,1,508316804,2098,null,"stCommon","Журналистика",{"$f":"MATCH(D12,Отчет!$C:$C,0)","v":20}]
[525602803,9,"БЖУР133",475501379,"Пятибратова","Екатерина","Васильевна","1301219077","Иностранный язык (английский)",1.92,"Экзамен","2014/2015 учебный год 3 модуль",null,17.28,1.92,1,1,508316804,2098,null,"stCommon","Журналистика",{"$f":"MATCH(D13,Отчет!$C:$C,0)","v":57}]
[525602869,10,"БЖУР133",475501513,"Рублева","Милена","Валерьевна","1301219080","Иностранный язык (английский)",1.92,"Экзамен","2014/2015 учебный год 3 модуль",null,19.2,1.92,1,1,508316804,2098,null,"stCommon","Журналистика",{"$f":"MATCH(D14,Отчет!$C:$C,0)","v":25}]
[525603001,9,"БЖУР133",475501641,"Стрельцова","Наталья","Сергеевна","1301219089","Иностранный язык (английский)",1.92,"Экзамен","2014/2015 учебный год 3 модуль",null,17.28,1.92,1,1,508316804,2098,null,"stCommon","Журналистика",{"$f":"MATCH(D15,Отчет!$C:$C,0)","v":64}]
[525603135,9,"БЖУР133",475501776,"Чернова","Кристина","Валериевна","1301219102","Иностранный язык (английский)",1.92,"Экзамен","2014/2015 учебный год 3 модуль",null,17.28,1.92,1,1,508316804,2098,null,"stCommon","Журналистика",{"$f":"MATCH(D16,Отчет!$C:$C,0)","v":24}]
[525603201,9,"БЖУР133",475501916,"Чернышева","Евгения","Эдуардовна","1301219103","Иностранный язык (английский)",1.92,"Экзамен","2014/2015 учебный год 3 модуль",null,17.28,1.92,1,1,508316804,2098,null,"stCommon","Журналистика",{"$f":"MATCH(D17,Отчет!$C:$C,0)","v":42}]
[525603723,8,"БЖУР134",475502663,"Вагапова","Юлия","Рстамовна","1301219016","Иностранный язык (английский)",1.92,"Экзамен","2014/2015 учебный год 3 модуль",null,15.36,1.92,1,1,508316804,2098,null,"stCommon","Журналистика",{"$f":"MATCH(D18,Отчет!$C:$C,0)","v":43}]
[525603855,8,"БЖУР134",475502790,"Дергалов","Руслан","Сергеевич","1301219028","Иностранный язык (английский)",1.92,"Экзамен","2014/2015 учебный год 3 модуль",null,15.36,1.92,1,1,508316804,2098,null,"stCommon","Журналистика",{"$f":"MATCH(D19,Отчет!$C:$C,0)","v":62}]
[525604321,9,"БЖУР134",475502924,"Литвякова","Евдокия","Алексеевна","1301219050","Иностранный язык (английский)",1.92,"Экзамен","2014/2015 учебный год 3 модуль",null,17.28,1.92,1,1,508316804,2098,null,"stCommon","Журналистика",{"$f":"MATCH(D20,Отчет!$C:$C,0)","v":36}]
[525604530,7,"БЖУР134",475503059,"Маркова","Кристина","Алексеевна","1301219058","Иностранный язык (английский)",1.92,"Экзамен","2014/2015 учебный год 3 модуль",null,13.44,1.92,1,1,508316804,2098,null,"stCommon","Журналистика",{"$f":"MATCH(D21,Отчет!$C:$C,0)","v":76}]
[525604798,8,"БЖУР134",475503187,"Робул","Павел","Константинович","1301219079","Иностранный язык (английский)",1.92,"Экзамен","2014/2015 учебный год 3 модуль",null,15.36,1.92,1,1,508316804,2098,null,"stCommon","Журналистика",{"$f":"MATCH(D22,Отчет!$C:$C,0)","v":38}]
[525602737,9,"БЖУР133",475563521,"Осипова","Светлана","Витальевна","1311219070","Иностранный язык (английский)",1.92,"Экзамен","2014/2015 учебный год 3 модуль",null,17.28,1.92,1,0,508316804,2098,null,"stCommon","Журналистика",{"$f":"MATCH(D23,Отчет!$C:$C,0)","v":71}]
[525603269,10,"БЖУР133",475563678,"Чехонадских","Дарья","Александровна","1301219104","Иностранный язык (английский)",1.92,"Экзамен","2014/2015 учебный год 3 модуль",null,19.2,1.92,1,1,508316804,2098,null,"stCommon","Журналистика",{"$f":"MATCH(D24,Отчет!$C:$C,0)","v":81}]
[525603654,8,"БЖУР134",475564485,"Басиладзе","Мариами","Рамазиевна","1311219007","Иностранный язык (английский)",1.92,"Экзамен","2014/2015 учебный год 3 модуль",null,15.36,1.92,1,0,508316804,2098,"ikPlanned","stCommon","Журналистика",{"$f":"MATCH(D25,Отчет!$C:$C,0)","v":80}]
[525603789,8,"БЖУР134",475564642,"Гимаева","Жанна","Эмзаровна","1311219021","Иностранный язык (английский)",1.92,"Экзамен","2014/2015 учебный год 3 модуль",null,15.36,1.92,1,0,508316804,2098,null,"stCommon","Журналистика",{"$f":"MATCH(D26,Отчет!$C:$C,0)","v":51}]
[525603921,7,"БЖУР134",475564787,"Досий","Зоряна","Владимировна","1301219109","Иностранный язык (английский)",1.92,"Экзамен","2014/2015 учебный год 3 модуль",null,13.44,1.92,1,1,508316804,2098,"ikPlanned","stCommon","Журналистика",{"$f":"MATCH(D27,Отчет!$C:$C,0)","v":99}]
[525603987,8,"БЖУР134",475564933,"Животнёв","Владислав","Николаевич","1311219035","Иностранный язык (английский)",1.92,"Экзамен","2014/2015 учебный год 3 модуль",null,15.36,1.92,1,0,508316804,2098,null,"stCommon","Журналистика",{"$f":"MATCH(D28,Отчет!$C:$C,0)","v":75}]
[525604053,8,"БЖУР134",475565084,"Зражаева","Алина","Сергеевна","1311219036","Иностранный язык (английский)",1.92,"Экзамен","2014/2015 учебный год 3 модуль",null,15.36,1.92,1,0,508316804,2098,null,"stCommon","Журналистика",{"$f":"MATCH(D29,Отчет!$C:$C,0)","v":49}]
[525604387,8,"БЖУР134",475565231,"Макарова","Юлия","Валерьевна","1311219054","Иностранный язык (английский)",1.92,"Экзамен","2014/2015 учебный год 3 модуль",null,15.36,1.92,1,0,508316804,2098,null,"stCommon","Журналистика",{"$f":"MATCH(D30,Отчет!$C:$C,0)","v":70}]
{"$rows_left_out":1201}