{"text_format":"1","workbook":"xlsx","n_sheets":2,"sheets":["Отчет","Данные"],"not_rendered":{"charts":0,"images":1,"macros":1,"external_links":0,"defined_names":0,"comments":0,"pivot_tables":0},"unopened":[],"bounds":{"document_bytes":16777216,"sheet_cells":100000,"rows_first":2000,"rows_last":500,"rows_between":2000,"halvings":0,"cell_chars":16384,"cell_head_chars":4096},"cells_cut":0,"cells_raw":0,"read":"whole","date_system":"1900"}

{"sheet":"Отчет","index":0,"n_rows":110,"n_cols":72,"rows_kept":110,"cut":false,"hidden":false,"merged":[[28,0,29,0],[40,0,41,0],[81,0,82,0],[85,0,86,0],[8,40,8,43],[7,40,7,45],[8,44,8,45],[8,46,8,60],[7,46,7,65],[8,61,8,65],[8,5,8,7],[7,5,7,12],[8,8,8,12],[8,13,8,28],[7,13,7,39],[8,29,8,39],[7,4,9,4],[7,2,9,2],[10,0,10,3],[7,1,9,1],[7,3,9,3],[7,0,9,0],[7,66,10,66],[7,71,10,71],[7,70,10,70],[7,68,10,68],[7,69,10,69],[7,67,10,67]]}
["Кумулятивный рейтинг студентов"]
["Дата выгрузки: 26.10.2015"]
["Период: с начала обучения по  2014/2015 учебный год II семестр"]
["Факультет/отделение: Факультет коммуникаций, медиа и дизайна"]
["Направление  подготовки: Направление \"Журналистика\""]
["Уровень образования, номер курса: Бакалавриат 1 курс"]
[]
["Место","Студент","ID","Группа","Образовательная программа студента","2014/2015 учебный год 1 модуль",null,null,null,null,null,null,null,"2014/2015 учебный год 2 модуль",null,null,null,null,null,null,null,null,null,null,null,null,null,null,null,null,null,null,null,null,null,null,null,null,null,null,"2014/2015 учебный год 3 модуль",null,null,null,null,null,"2014/2015 учебный год 4 модуль",null,null,null,null,null,null,null,null,null,null,null,null,null,null,null,null,null,null,null,"Кумулятивный рейтинг","Сумма оценок","Количество оценок","Средняя оценка","Минимальный балл","Номер места"]
[null,null,null,null,null,"Экзамен",null,null,"Зачет",null,null,null,null,"Экзамен",null,null,null,null,null,null,null,null,null,null,null,null,null,null,null,"Зачет",null,null,null,null,null,null,null,null,null,null,"Экзамен",null,null,null,"Зачет",null,"Экзамен",null,null,null,null,null,null,null,null,null,null,null,null,null,null,"Зачет"]
[null,null,null,null,null,"Безопасность жизнедеятельности","Информационные технологии подготовки печатных и электронных СМИ","Проектный семинар","Безопасность жизнедеятельности","Безопасность жизнедеятельности","Безопасность жизнедеятельности","Проектный семинар","Проектный семинар","Английский язык","Английский язык","Английский язык","Иностранный язык (интенсивный курс английского языка для начинающих) (1 курс)","История и теория литературы","История и теория литературы","Основы работы с Adobe Photoshop и GIMP","Проектный семинар","Создание Интернет-проектов. Уровень 1. Язык HTML","Социология","Теория и практика русского литературного языка","Теория и практика русского литературного языка","Философия","Философия","Философия","Философия","Английский язык","Английский язык","Английский язык","Проектный семинар","Социология","Теория и практика русского литературного языка","Теория и практика русского литературного языка","Физическая культура","Физическая культура","Физическая культура","Физическая культура","История медиакоммуникаций","Проектный семинар","Расширенные возможности Adobe Photoshop и GIMP","Советская массовая культура: жанровое кино","История медиакоммуникаций","Креативное письмо","Английский язык","Английский язык","Английский язык","Иностранный язык (интенсивный курс английского языка для начинающих) (1 курс)","История","История","Право","Проектный семинар","Психология","Психология","Рассказывание историй в журналистике","Теория медиакоммуникаций","Техника речи","Экономика","Экономика","Рассказывание историй в журналистике","Теория медиакоммуникаций","Физическая культура","Физическая культура","Физическая культура"]
["Число кумулятивных кредитов:",null,null,null,null,1,3,2,0.5,1,3,2,3,3.56,2,3.56,7.11,5,7,2,2,2,4,4,5,3,4,5,6,3.56,2.2200000000000002,2.67,2,3,3,5,0,0.22,0.25,1,5,2,2,2,8.66,0,4.4400000000000004,2.7800000000000002,4.4400000000000004,8.89,6,7,4,2,3,4,0,4,5,3.74,6,0,2.34,0,0.22,0.25]
[1,"Мащенко Владислава Владимировна",515640266,"БЖУР143","Журналистика",9,10,9,null,null,null,null,null,null,null,null,8,10,null,null,9,null,8,null,9,null,10,null,null,null,null,null,null,null,null,null,10,null,null,null,10,8,null,null,null,null,null,null,null,9,null,9,8,9,null,10,null,10,null,null,10,null,null,10,null,null,697.89,185,20,{"$f":"IF(BQ12 > 0,BP12/BQ12,0)","v":9.25},{"$f":"MIN($F12:BN12)","v":8},1]
[2,"Касьяненко Дарья Алексеевна",498435661,"БЖУР141","Журналистика",9,10,10,null,null,null,null,null,9,null,null,null,10,null,null,10,9,8,null,9,null,8,null,null,null,null,null,null,null,null,null,10,null,null,null,10,8,null,null,null,null,9,null,null,null,null,9,7,9,null,9,10,10,9,null,10,null,null,10,null,null,684,212,23,{"$f":"IF(BQ13 > 0,BP13/BQ13,0)","v":9.2173913043478262},{"$f":"MIN($F13:BN13)","v":7},2]
[3,"Древова Юлия Николаевна",498434310,"БЖУР143","Журналистика",9,10,9,null,null,null,null,null,9,null,null,null,10,null,null,9,null,8,null,9,null,10,null,null,null,null,null,null,null,null,null,10,null,null,null,10,8,null,null,null,null,9,null,null,null,null,9,8,10,null,9,null,10,9,null,10,null,null,10,null,null,676,195,21,{"$f":"IF(BQ14 > 0,BP14/BQ14,0)","v":9.2857142857142865},{"$f":"MIN($F14:BN14)","v":8},3]
[4,"Смирнова Владислава Константиновна",498434538,"БЖУР143","Журналистика",9,10,10,null,null,null,null,null,7,null,null,null,10,null,null,9,null,7,null,9,null,10,null,null,null,null,null,null,null,null,null,10,null,null,null,9,7,null,null,null,null,8,null,null,null,null,9,8,10,null,10,null,8,9,null,10,null,null,10,null,null,651.44000000000005,189,21,{"$f":"IF(BQ15 > 0,BP15/BQ15,0)","v":9},{"$f":"MIN($F15:BN15)","v":7},4]
[5,"Гулина Дарья Николаевна",499631216,"БЖУР142","Журналистика",9,10,10,null,null,null,null,null,8,null,null,null,10,null,null,8,null,7,null,8,null,10,null,null,null,null,null,null,null,null,null,10,null,null,null,9,10,null,null,null,null,9,null,null,null,null,9,8,8,null,8,null,9,9,null,9,null,null,10,null,null,644.44000000000005,188,21,{"$f":"IF(BQ16 > 0,BP16/BQ16,0)","v":8.9523809523809526},{"$f":"MIN($F16:BN16)","v":7},5]
[6,"Аюпова Арина Альбертовна",498435818,"БЖУР143","Журналистика",9,10,10,null,null,null,null,null,9,null,null,null,10,null,null,9,null,8,null,9,null,10,null,null,null,null,null,null,null,null,null,10,null,null,null,9,9,null,null,null,null,7,null,null,null,null,9,7,10,null,8,null,9,9,null,8,null,null,10,null,null,642.11999999999989,189,21,{"$f":"IF(BQ17 > 0,BP17/BQ17,0)","v":9},{"$f":"MIN($F17:BN17)","v":7},6]
[7,"Белюга Татьяна Сергеевна",498436205,"БЖУР143","Журналистика",8,10,9,null,null,null,null,null,9,null,null,null,10,null,null,10,null,8,null,9,null,10,null,null,null,null,null,null,null,null,null,10,null,null,null,9,9,null,null,null,null,8,null,null,null,null,9,9,10,null,10,null,10,null,null,10,null,null,10,null,null,632.55999999999995,187,20,{"$f":"IF(BQ18 > 0,BP18/BQ18,0)","v":9.35},{"$f":"MIN($F18:BN18)","v":8},7]
[8,"Тимошенкова Мария Александровна",498434914,"БЖУР141","Журналистика",9,10,10,null,null,null,null,null,9,null,null,null,10,null,null,10,null,7,null,9,null,9,null,null,null,null,null,null,null,null,null,10,null,null,null,9,9,null,null,null,null,10,null,null,null,null,8,8,8,null,6,null,9,8,null,8,null,null,10,null,null,629.43999999999994,186,21,{"$f":"IF(BQ19 > 0,BP19/BQ19,0)","v":8.8571428571428577},{"$f":"MIN($F19:BN19)","v":6},8]
[9,"Лаптев Андрей Вячеславович",498436133,"БЖУР142","Журналистика",9,10,10,null,null,null,null,null,8,null,null,null,10,null,null,8,null,8,null,10,null,10,null,null,null,null,null,null,null,null,null,10,null,null,null,9,10,null,null,null,null,7,null,null,null,null,7,8,10,null,6,10,8,9,null,9,null,null,10,null,null,627.55999999999995,196,22,{"$f":"IF(BQ20 > 0,BP20/BQ20,0)","v":8.9090909090909083},{"$f":"MIN($F20:BN20)","v":6},9]
[10,"Спирин Максим Геннадьевич",498434786,"БЖУР143","Журналистика",9,10,10,null,null,null,null,null,8,null,null,null,10,null,null,9,null,7,null,8,null,10,null,null,null,null,null,null,null,null,null,10,null,null,null,9,7,null,null,null,null,9,null,null,null,null,9,8,10,null,8,10,9,8,null,7,null,null,10,null,null,627.44000000000005,195,22,{"$f":"IF(BQ21 > 0,BP21/BQ21,0)","v":8.8636363636363633},{"$f":"MIN($F21:BN21)","v":7},10]
[11,"Сорокина Анастасия Андреевна",498435355,"БЖУР142","Журналистика",9,10,10,null,null,null,null,null,8,null,null,null,10,null,null,9,null,6,null,9,null,10,null,null,null,null,null,null,null,null,null,10,null,null,null,9,10,null,null,null,null,8,null,null,null,null,7,6,9,null,9,null,8,9,null,9,null,null,10,null,null,623,185,21,{"$f":"IF(BQ22 > 0,BP22/BQ22,0)","v":8.8095238095238102},{"$f":"MIN($F22:BN22)","v":6},11]
[12,"Казарновский Павел Леонидович",498435480,"БЖУР141","Журналистика",8,10,10,null,null,null,null,null,9,null,null,null,10,null,null,10,null,7,null,8,null,9,null,null,null,null,null,null,null,null,null,10,null,null,null,10,8,null,null,null,null,8,null,null,null,null,9,8,7,null,7,null,8,8,null,8,null,null,10,null,null,622.55999999999995,182,21,{"$f":"IF(BQ23 > 0,BP23/BQ23,0)","v":8.6666666666666661},{"$f":"MIN($F23:BN23)","v":7},12]
[13,"Сапонова Анастасия Владимировна",498436063,"БЖУР143","Журналистика",9,10,9,null,null,null,null,null,6,null,null,null,8,null,null,9,null,7,null,8,null,8,null,null,null,null,null,null,null,null,null,10,null,null,null,9,9,null,null,null,null,6,null,null,null,null,9,7,10,null,9,null,10,8,null,10,null,null,10,null,null,613,181,21,{"$f":"IF(BQ24 > 0,BP24/BQ24,0)","v":8.6190476190476186},{"$f":"MIN($F24:BN24)","v":6},13]
[14,"Бережная Анна Андреевна",509644468,"БЖУР141","Журналистика",8,10,10,null,null,null,null,null,8,null,null,null,10,null,null,10,null,6,null,9,null,8,null,null,null,null,null,null,null,null,null,10,null,null,null,9,9,null,null,null,null,8,null,null,null,null,9,7,7,null,8,8,9,8,null,7,null,null,10,null,null,611,188,22,{"$f":"IF(BQ25 > 0,BP25/BQ25,0)","v":8.545454545454545},{"$f":"MIN($F25:BN25)","v":6},14]
[15,"Маслаков Денис Андреевич",498436229,"БЖУР143","Журналистика",9,10,10,null,null,null,null,null,7,null,null,null,10,null,null,9,null,7,null,8,null,10,null,null,null,null,null,null,null,null,null,10,null,null,null,10,8,null,null,null,null,7,null,null,null,null,8,7,10,null,8,null,10,8,null,6,null,null,10,null,null,609,182,21,{"$f":"IF(BQ26 > 0,BP26/BQ26,0)","v":8.6666666666666661},{"$f":"MIN($F26:BN26)","v":6},15]
[16,"Михайлиди Александра Христофоровна",498435454,"БЖУР143","Журналистика",9,10,10,null,null,null,null,null,7,null,null,null,9,null,null,10,null,7,null,8,null,10,null,null,null,null,null,null,null,null,null,10,null,null,null,9,9,null,null,null,null,7,null,null,null,null,9,6,10,null,9,null,8,8,null,7,null,null,10,null,null,608,182,21,{"$f":"IF(BQ27 > 0,BP27/BQ27,0)","v":8.6666666666666661},{"$f":"MIN($F27:BN27)","v":6},16]
[17,"Мельникова Ксения Витальевна",515640294,"БЖУР142","Журналистика",6,10,10,null,null,null,null,null,8,null,null,null,10,null,null,9,null,7,null,10,null,8,null,null,null,null,null,null,null,null,null,10,null,null,null,7,10,null,null,null,null,8,null,null,null,null,10,7,10,null,9,null,10,null,null,10,null,null,10,null,null,607,179,20,{"$f":"IF(BQ28 > 0,BP28/BQ28,0)","v":8.9499999999999993},{"$f":"MIN($F28:BN28)","v":6},17]
["18 - 19","Финутикова Дарья Николаевна",498434478,"БЖУР143","Журналистика",8,10,9,null,null,null,null,null,7,null,null,null,10,null,null,9,null,7,null,8,null,9,null,null,null,null,null,null,null,null,null,10,null,null,null,8,9,null,null,null,null,7,null,null,null,null,7,7,10,null,8,null,8,8,null,10,null,null,10,null,null,603,179,21,{"$f":"IF(BQ29 > 0,BP29/BQ29,0)","v":8.5238095238095237},{"$f":"MIN($F29:BN29)","v":7},18]
[null,"Мельник Анна Геннадьевна",498434226,"БЖУР141","Журналистика",null,9,null,null,9,null,8,null,null,null,null,null,10,null,null,10,null,5,null,null,null,9,null,null,8,null,null,null,null,null,9,10,null,null,null,10,10,null,null,null,null,8,null,null,null,null,8,7,9,null,6,null,8,8,null,8,null,null,10,null,null,603,179,21,{"$f":"IF(BQ30 > 0,BP30/BQ30,0)","v":8.5238095238095237},{"$f":"MIN($F30:BN30)","v":5},19]
{"$rows_left_out":81}
{"sheet":"Данные","index":1,"n_rows":2024,"n_cols":21,"rows_kept":2024,"cut":false,"hidden":true,"merged":[]}
["ID","Оценка из 10 баллов","Группа","Студент","Фамилия","Имя","Отчество","Номер студенческого билета","Строка учебного плана","Кумулятивных кредитов за испытание","Вид испытания","Календарный период по плану","Неявка","В кумулятивный рейтинг","Оценка зачет/назачет","Является бюджетным","Учебный план","Вид записи РУП","Вид дисциплины по ИУП","Номер Row"]
[1,2,3,4,5,6,7,8,9,10,11,12,13,14,15,16,17,18,19,20]
[508206705,9,"БЖУР142",498434150,"Шубина","Дарина","Андреевна","М141БЖУРН081","Безопасность жизнедеятельности",1,"Экзамен","2014/2015 учебный год 1 модуль",null,9,1,1,475555736,2098,null,"Журналистика",{"$f":"MATCH(D3,Отчет!$C:$C,0)","v":85}]
[508206965,7,"БЖУР142",498434254,"Вопиловская","Мария","Николаевна","М141БЖУРН015","Безопасность жизнедеятельности",1,"Экзамен","2014/2015 учебный год 1 модуль",null,7,1,1,475555736,2098,null,"Журналистика",{"$f":"MATCH(D4,Отчет!$C:$C,0)","v":75}]
[508207029,8,"БЖУР143",498434282,"Ширяева","Дарья","Алексеевна","М141БЖУРН079","Безопасность жизнедеятельности",1,"Экзамен","2014/2015 учебный год 1 модуль",null,8,1,1,475555736,2098,null,"Журналистика",{"$f":"MATCH(D5,Отчет!$C:$C,0)","v":101}]
[508203727,9,"БЖУР142",498435054,"Бочаров","Иван","Михайлович","М141БЖУРН009","Безопасность жизнедеятельности",1,"Экзамен","2014/2015 учебный год 1 модуль",null,9,1,1,475555736,2098,null,"Журналистика",{"$f":"MATCH(D6,Отчет!$C:$C,0)","v":54}]
[508203796,7,"БЖУР142",498435086,"Синицына","Анастасия","Михайловна","М141БЖУРН064","Безопасность жизнедеятельности",1,"Экзамен","2014/2015 учебный год 1 модуль",null,7,1,1,475555736,2098,null,"Журналистика",{"$f":"MATCH(D7,Отчет!$C:$C,0)","v":68}]
[508203862,8,"БЖУР143",498435110,"Фадеева","Анастасия","Германовна","М141БЖУРН071","Безопасность жизнедеятельности",1,"Экзамен","2014/2015 учебный год 1 модуль",null,8,1,1,475555736,2098,null,"Журналистика",{"$f":"MATCH(D8,Отчет!$C:$C,0)","v":102}]
[508203926,7,"БЖУР143",498435138,"Копелевич","Екатерина","Ильинична","М141БЖУРН041","Безопасность жизнедеятельности",1,"Экзамен","2014/2015 учебный год 1 модуль",null,7,1,1,475555736,2098,null,"Журналистика",{"$f":"MATCH(D9,Отчет!$C:$C,0)","v":94}]
[508204119,9,"БЖУР142",498435244,"Кондратов","Антон","Сергеевич","М141БЖУРН040","Безопасность жизнедеятельности",1,"Экзамен","2014/2015 учебный год 1 модуль",null,9,1,0,475555736,2098,null,"Журналистика",{"$f":"MATCH(D10,Отчет!$C:$C,0)","v":69}]
[508204183,8,"БЖУР142",498435271,"Берняева","Евгения","Игоревна","М141БЖУРН007","Безопасность жизнедеятельности",1,"Экзамен","2014/2015 учебный год 1 модуль",null,8,1,0,475555736,2098,null,"Журналистика",{"$f":"MATCH(D11,Отчет!$C:$C,0)","v":76}]
[508204247,7,"БЖУР141",498435298,"Авдонина","Дарья","Романовна","М141БЖУРН001","Безопасность жизнедеятельности",1,"Экзамен","2014/2015 учебный год 1 модуль",null,7,1,0,475555736,2098,null,"Журналистика",{"$f":"MATCH(D12,Отчет!$C:$C,0)","v":86}]
[508204311,9,"БЖУР142",498435329,"Гимаева","Майя","Родионовна","М141БЖУРН018","Безопасность жизнедеятельности",1,"Экзамен","2014/2015 учебный год 1 модуль",null,9,1,0,475555736,2098,null,"Журналистика",{"$f":"MATCH(D13,Отчет!$C:$C,0)","v":58}]
[508204375,9,"БЖУР142",498435355,"Сорокина","Анастасия","Андреевна","М141БЖУРН066","Безопасность жизнедеятельности",1,"Экзамен","2014/2015 учебный год 1 модуль",null,9,1,0,475555736,2098,null,"Журналистика",{"$f":"MATCH(D14,Отчет!$C:$C,0)","v":22}]
[508204443,7,"БЖУР141",498435377,"Самиленко","Софья","Игоревна","М141БЖУРН061","Безопасность жизнедеятельности",1,"Экзамен","2014/2015 учебный год 1 модуль",null,7,1,0,475555736,2098,null,"Журналистика",{"$f":"MATCH(D15,Отчет!$C:$C,0)","v":60}]
[508204571,9,"БЖУР142",498435428,"Тороп","Анастасия","Леонидовна","М141БЖУРН070","Безопасность жизнедеятельности",1,"Экзамен","2014/2015 учебный год 1 модуль",null,9,1,0,475555736,2098,null,"Журналистика",{"$f":"MATCH(D16,Отчет!$C:$C,0)","v":41}]
[508204699,8,"БЖУР141",498435480,"Казарновский","Павел","Леонидович","М141БЖУРН033","Безопасность жизнедеятельности",1,"Экзамен","2014/2015 учебный год 1 модуль",null,8,1,0,475555736,2098,null,"Журналистика",{"$f":"MATCH(D17,Отчет!$C:$C,0)","v":23}]
[508204763,7,"БЖУР142",498435509,"Аникина","Мария","Михайловна","М141БЖУРН002","Безопасность жизнедеятельности",1,"Экзамен","2014/2015 учебный год 1 модуль",null,7,1,0,475555736,2098,null,"Журналистика",{"$f":"MATCH(D18,Отчет!$C:$C,0)","v":62}]
[508204828,7,"БЖУР142",498435535,"Васильчук","Татьяна","Алексеевна","М141БЖУРН012","Безопасность жизнедеятельности",1,"Экзамен","2014/2015 учебный год 1 модуль",null,7,1,0,475555736,2098,null,"Журналистика",{"$f":"MATCH(D19,Отчет!$C:$C,0)","v":97}]
[508205025,8,"БЖУР142",498435609,"Манькова","Елизавета","Сергеевна","М141БЖУРН049","Безопасность жизнедеятельности",1,"Экзамен","2014/2015 учебный год 1 модуль",null,8,1,0,475555736,2098,null,"Журналистика",{"$f":"MATCH(D20,Отчет!$C:$C,0)","v":90}]
[508205166,9,"БЖУР141",498435661,"Касьяненко","Дарья","Алексеевна","М141БЖУРН036","Безопасность жизнедеятельности",1,"Экзамен","2014/2015 учебный год 1 модуль",null,9,1,0,475555736,2098,null,"Журналистика",{"$f":"MATCH(D21,Отчет!$C:$C,0)","v":13}]
[508205231,8,"БЖУР143",498435688,"Виткова","Анастасия","Андреевна","М141БЖУРН013","Безопасность жизнедеятельности",1,"Экзамен","2014/2015 учебный год 1 модуль",null,8,1,0,475555736,2098,null,"Журналистика",{"$f":"MATCH(D22,Отчет!$C:$C,0)","v":98}]
[508205299,8,"БЖУР142",498435714,"Зыбина","Мария","Сергеевна","М141БЖУРН029","Безопасность жизнедеятельности",1,"Экзамен","2014/2015 учебный год 1 модуль",null,8,1,0,475555736,2098,null,"Журналистика",{"$f":"MATCH(D23,Отчет!$C:$C,0)","v":65}]
[508205371,7,"БЖУР142",498435740,"Мещерская","Мария","Всеволодовна","М141БЖУРН052","Безопасность жизнедеятельности",1,"Экзамен","2014/2015 учебный год 1 модуль",null,7,1,0,475555736,2098,null,"Журналистика",{"$f":"MATCH(D24,Отчет!$C:$C,0)","v":63}]
[508205443,8,"БЖУР141",498435766,"Кошеварова","Елена","Александровна","М141БЖУРН042","Безопасность жизнедеятельности",1,"Экзамен","2014/2015 учебный год 1 модуль",null,8,1,0,475555736,2098,null,"Журналистика",{"$f":"MATCH(D25,Отчет!$C:$C,0)","v":37}]
[508205095,8,"БЖУР143",498435635,"Глозман","Юлия","Игоревна","М141БЖУРН019","Безопасность жизнедеятельности",1,"Экзамен","2014/2015 учебный год 1 модуль",null,8,1,0,475555736,2098,null,"Журналистика",{"$f":"MATCH(D26,Отчет!$C:$C,0)","v":66}]
[508207969,9,"БЖУР143",498434642,"Лунина","Елена","Александровна","М141БЖУРН047","Безопасность жизнедеятельности",1,"Экзамен","2014/2015 учебный год 1 модуль",null,9,1,1,475555736,2098,null,"Журналистика",{"$f":"MATCH(D27,Отчет!$C:$C,0)","v":88}]
[523012019,8,"БЖУР141",509644468,"Бережная","Анна","Андреевна","М141БЖУРН083","Безопасность жизнедеятельности",1,"Экзамен","2014/2015 учебный год 1 модуль",null,8,1,1,475555736,2098,null,"Журналистика",{"$f":"MATCH(D28,Отчет!$C:$C,0)","v":25}]
[560426384,5,"БЖУР143",509644493,"Воронина","Екатерина","Андреевна","М141БЖУРН084","Безопасность жизнедеятельности",1,"Экзамен","2014/2015 учебный год 1 модуль",null,5,1,1,475555736,2098,null,"Журналистика",{"$f":"MATCH(D29,Отчет!$C:$C,0)","v":67}]
[523011462,7,"БЖУР141",509644517,"Иванова","Евгения","Александровна","М141БЖУРН085","Безопасность жизнедеятельности",1,"Экзамен","2014/2015 учебный год 1 модуль",null,7,1,1,475555736,2098,null,"Журналистика",{"$f":"MATCH(D30,Отчет!$C:$C,0)","v":71}]
{"$rows_left_out":1994}