{"text_format":"1","workbook":"xlsx","n_sheets":2,"sheets":["Отчет","Данные"],"not_rendered":{"charts":0,"images":1,"macros":1,"external_links":0,"defined_names":0,"comments":0,"pivot_tables":0},"unopened":[],"bounds":{"document_bytes":16777216,"sheet_cells":100000,"rows_first":2000,"rows_last":500,"rows_between":2000,"halvings":0,"cell_chars":16384,"cell_head_chars":4096},"cells_cut":0,"cells_raw":0,"read":"whole","date_system":"1900"}

{"sheet":"Отчет","index":0,"n_rows":110,"n_cols":33,"rows_kept":110,"cut":false,"hidden":false,"merged":[[7,31,10,31],[10,0,10,4],[7,30,10,30],[7,21,10,21],[7,24,10,24],[7,0,9,0],[7,29,10,29],[7,22,10,22],[0,27,0,30],[7,28,10,28],[7,26,10,26],[7,3,9,3],[7,25,10,25],[1,27,2,30],[7,23,10,23],[7,4,9,4],[15,0,16,0],[23,0,24,0],[26,0,27,0],[7,27,10,27],[7,5,7,9],[8,5,8,9],[8,10,8,19],[7,10,7,20],[11,0,12,0],[7,2,9,2],[7,1,9,1]]}
["Текущий рейтинг студентов (до пересдач)",null,null,null,null,null,null,null,null,null,null,null,null,null,null,null,null,null,null,null,null,null,null,null,null,null,null,"Приложение 3"]
["Дата выгрузки: 20.01.2016",null,null,null,null,null,null,null,null,null,null,null,null,null,null,null,null,null,null,null,null,null,null,null,null,null,null,"к Положению о рейтинговой системе комплексной оценки знаний студентов "]
["Период: c 2015/2016 учебный год I семестр по 2015/2016 учебный год I семестр"]
["Факультет/отделение: Факультет коммуникаций, медиа и дизайна"]
["Направление подготовки: Журналистика"]
["Уровень образования, номер курса: Бакалавриат 3 курс",null,null,null,null,null," - студенты имеющие задолженности"]
[null,null,null,null,null,"*"," - изучение по ИУП"]
["Место","Студент","ID","Группа","Образовательная программа студента","2015/2016 учебный год 1 модуль",null,null,null,null,"2015/2016 учебный год 2 модуль",null,null,null,null,null,null,null,null,null,null,"Кредитно-рейтинговая оценка","Нормировочный коэффициент","Сумма всех кредитов ","Нормированная кредитно-рейтинговая оценка","Сумма всех оценок","Количество всех оценок","Средний балл","Минимальный балл","Наличие неудовлетворительных оценок и неявок","Количество удовлетворительных оценок","Номер места"]
[null,null,null,null,null,"Экзамен",null,null,null,null,"Экзамен",null,null,null,null,null,null,null,null,null,"Зачет"]
[null,null,null,null,null,"Документы и презентации в LaTeX","Информационные технологии подготовки печатных и электронных СМИ","Мода, костюм, личность: человек и его одежда в общественном пространстве","Первая производственная практика","Технология работы журналиста (платформы)","Исследование медиа-процессов","История и теория литературы","История и теория литературы","Курс маркетинговых исследований ГфК","Парапсихологическая феноменология: психологический анализ","Правовая аналитика","Профессиональные творческие студии (жанры, инструменты)","Профессиональные творческие студии (жанры, инструменты)","Технология работы журналиста (платформы)","Философия","Физическая культура"]
["Число текущих кредитов:",null,null,null,null,0,3,0,0,2.59,1.05,2.09,3.31,0,0,0,4,4.8500000000000005,2.2600000000000002,4,0.44]
["1 - 2","Николаева Мария Дмитриевна",475497479,"БЖУР131","Журналистика",null,null,null,10,10,10,10,null,null,null,null,null,10,10,null,10,132.80000000000001,{"$f":"IF(X12 > 0, MAX(X$12:X$110) / X12, 0)","v":1.3012048192771086},13.28,{"$f":"V12*W12","v":172.80000000000004},70,7,{"$f":"IF(AA12 > 0,Z12/AA12,0)","v":10},{"$f":"MIN($F12:U12)","v":10},null,7,1,"ОК"]
[null,"Правдюк Анна Сергеевна",481500535,"БЖУР132","Журналистика",null,null,null,10,10,10,10,null,null,null,null,null,10,10,null,10,132.80000000000001,1.3012048192771086,13.28,172.80000000000004,70,7,10,{"$f":"MIN($F13:U13)","v":10},null,7,2,"ОК"]
[3,"Лучкив Ольга Викторовна",481504458,"БЖУР134","Журналистика",null,null,null,10,10,9,10,null,null,null,null,null,10,9,null,10,129.49,1.3012048192771086,13.28,168.49301204819281,68,7,9.7142857142857135,{"$f":"MIN($F14:U14)","v":9},null,7,3,"ОК"]
[4,"Молоствова Анна Александровна",481501975,"БЖУР133","Журналистика",null,null,null,10,10,9,10,null,null,null,null,null,9,10,null,10,126.9,1.3012048192771086,13.28,165.12289156626508,68,7,9.7142857142857135,{"$f":"MIN($F15:U15)","v":9},null,7,4,"ОК"]
["5 - 6","Федорова Анастасия Александровна",475499056,"БЖУР132","Журналистика",null,null,null,9,8,9,10,null,null,null,null,null,10,10,null,10,126.57,1.3012048192771086,13.28,164.69349397590364,66,7,9.4285714285714288,{"$f":"MIN($F16:U16)","v":8},null,7,5,"ОК"]
[null,"Рудакова Юлия Владиславовна",475498778,"БЖУР132","Журналистика",null,null,null,8,8,9,10,null,null,null,null,null,10,10,null,10,126.57,1.3012048192771086,13.28,164.69349397590364,65,7,9.2857142857142865,{"$f":"MIN($F17:U17)","v":8},null,7,6,"ОК"]
[7,"Липчанская Анастасия Алексеевна",475501239,"БЖУР133","Журналистика",null,null,null,9,10,10,9,null,null,null,null,null,9,10,null,10,125.85999999999999,1.3012048192771086,13.28,163.76963855421687,67,7,9.5714285714285712,{"$f":"MIN($F18:U18)","v":9},null,7,7,"ОК"]
[8,"Нещадимова Дарья Викторовна",481497484,"БЖУР131","Журналистика",null,null,null,8,9,10,10,null,null,null,null,null,9,10,null,10,125.36,1.3012048192771086,13.28,163.11903614457833,66,7,9.4285714285714288,{"$f":"MIN($F19:U19)","v":8},null,7,8,"ОК"]
[9,"Зражаева Алина Сергеевна",475565084,"БЖУР134","Журналистика",null,null,null,10,10,5,10,null,null,null,null,null,10,9,null,10,125.28999999999999,1.3012048192771086,13.28,163.02795180722893,64,7,9.1428571428571423,{"$f":"MIN($F20:U20)","v":5},null,7,9,"ОК"]
[10,"Суханова Юлия Александровна",475503448,"БЖУР134","Журналистика",null,null,null,8,10,9,9,null,null,null,null,null,9,10,null,10,124.81,1.3012048192771086,13.28,162.40337349397592,65,7,9.2857142857142865,{"$f":"MIN($F21:U21)","v":8},null,7,10,"ОК"]
[11,"Огурцова Евгения Алексеевна",475498638,"БЖУР132","Журналистика",null,null,null,10,10,8,9,null,null,null,null,null,9,10,null,10,123.75999999999999,1.3012048192771086,13.28,161.03710843373494,66,7,9.4285714285714288,{"$f":"MIN($F22:U22)","v":8},null,7,11,"ОК"]
[12,"Булатова Катерина Николаевна",475498195,"БЖУР132","Журналистика",null,null,"нет оценки",10,9,10,9,null,null,null,null,null,9,10,null,10,123.27000000000001,1.3012048192771086,13.28,160.3995180722892,67,7,9.5714285714285712,{"$f":"MIN($F23:U23)","v":9},null,7,12,"ОК"]
["13 - 14","Ревоненко Анна Николаевна",481500688,"БЖУР132","Журналистика",null,null,null,10,8,10,10,null,null,null,null,null,9,10,null,10,122.77,1.3012048192771086,13.28,159.74891566265063,67,7,9.5714285714285712,{"$f":"MIN($F24:U24)","v":8},null,7,13,"ОК"]
[null,"Яковец Елизавета Николаевна",475497867,"БЖУР131","Журналистика",null,null,null,10,8,10,10,null,null,null,null,null,9,10,null,10,122.77,1.3012048192771086,13.28,159.74891566265063,67,7,9.5714285714285712,{"$f":"MIN($F25:U25)","v":8},null,7,14,"ОК"]
[15,"Круглова Ирина Викторовна",481504593,"БЖУР134","Журналистика",null,null,null,10,10,6,9,null,null,null,null,null,10,8,null,10,121.99000000000001,1.3012048192771086,13.28,158.73397590361449,63,7,9,{"$f":"MIN($F26:U26)","v":6},null,7,15,"ОК"]
["16 - 17","Дымчишина Александра Юрьевна",475497099,"БЖУР131","Журналистика",null,null,null,9,8,9,10,null,null,null,null,null,9,10,null,10,121.72,1.3012048192771086,13.28,158.38265060240965,65,7,9.2857142857142865,{"$f":"MIN($F27:U27)","v":8},null,7,16,"ОК"]
[null,"Лебедева Ксения Кирилловна",481500039,"БЖУР132","Журналистика",null,null,null,9,8,9,10,null,null,null,null,null,9,10,null,10,121.72,1.3012048192771086,13.28,158.38265060240965,65,7,9.2857142857142865,{"$f":"MIN($F28:U28)","v":8},null,7,17,"ОК"]
[18,"Астапенко Ольга Юрьевна",474332631,"БЖУР131","Журналистика",null,null,null,10,10,8,10,null,null,null,null,null,8,10,null,10,121,1.3012048192771086,13.28,157.44578313253015,66,7,9.4285714285714288,{"$f":"MIN($F29:U29)","v":8},null,7,18,"ОК"]
[19,"Афанасьева Татьяна Валерьевна",481496658,"БЖУР131","Журналистика",null,null,null,10,9,7,9,null,null,null,null,null,9,10,null,10,120.12,1.3012048192771086,13.28,156.30072289156629,64,7,9.1428571428571423,{"$f":"MIN($F30:U30)","v":7},null,7,19,"ОК"]
[20,"Герасимова Мария Александровна",475562579,"БЖУР133","Журналистика",null,null,null,10,9,9,9,null,null,null,null,null,9,9,null,10,119.96000000000001,1.3012048192771086,13.28,156.09253012048197,65,7,9.2857142857142865,{"$f":"MIN($F31:U31)","v":9},null,7,20,"ОК"]
[21,"Чернышева Евгения Эдуардовна",475501916,"БЖУР133","Журналистика",0,null,null,9,8,9,9,null,"нет оценки",null,null,null,9,10,null,10,119.63,1.3012048192771086,13.28,155.66313253012049,64,8,8,{"$f":"MIN($F32:U32)","v":0},null,7,21,"ОК"]
[22,"Головина Евгения Павловна",475500628,"БЖУР133","Журналистика",null,null,null,9,8,6,9,null,null,null,null,null,10,9,null,10,119.07,1.3012048192771086,13.28,154.93445783132532,61,7,8.7142857142857135,{"$f":"MIN($F33:U33)","v":6},null,7,22,"ОК"]
[23,"Чернова Кристина Валериевна",475501776,"БЖУР133","Журналистика",null,null,null,10,10,6,10,null,null,null,null,null,8,10,null,10,118.9,1.3012048192771086,13.28,154.71325301204823,64,7,9.1428571428571423,{"$f":"MIN($F34:U34)","v":6},null,7,23,"ОК"]
[24,"Савина София Леонидовна",481505031,"БЖУР134","Журналистика",null,null,null,10,9,10,9,null,null,null,null,null,9,8,null,10,118.75000000000001,1.3012048192771086,13.28,154.51807228915666,65,7,9.2857142857142865,{"$f":"MIN($F35:U35)","v":8},null,7,24,"ОК"]
[25,"Маленкова Мария Александровна",475565410,"БЖУР134","Журналистика",null,null,null,9,10,7,9,null,null,null,null,null,8,10,null,10,117.86,1.3012048192771086,13.28,153.36000000000001,63,7,9,{"$f":"MIN($F36:U36)","v":7},null,7,25,"ОК"]
[26,"Таиров Ринат Маратович",475503575,"БЖУР134","Журналистика",null,null,null,10,10,9,9,null,null,null,null,null,8,9,null,10,117.69999999999999,1.3012048192771086,13.28,153.15180722891566,65,7,9.2857142857142865,{"$f":"MIN($F37:U37)","v":8},null,7,26,"ОК"]
[27,"Жвик Анастасия Николаевна",475497229,"БЖУР131","Журналистика",null,null,null,10,7,8,10,null,null,null,null,null,9,10,null,null,113.67999999999999,1.3457943925233646,12.84,152.98990654205608,54,6,9,{"$f":"MIN($F38:U38)","v":7},null,6,27,"ОК"]
[28,"Стешенкова Александра Евгеньевна",475565869,"БЖУР134","Журналистика",null,null,null,9,10,9,10,null,null,null,null,null,8,8,null,10,117.53,1.3012048192771086,13.28,152.93060240963857,64,7,9.1428571428571423,{"$f":"MIN($F39:U39)","v":8},null,7,28,"ОК"]
[29,"Цегалко Яна Николаевна",481500835,"БЖУР132","Журналистика",null,null,"нет оценки",10,10,0,10,null,null,null,null,null,9,9,null,10,115.19,1.3012048192771086,13.28,149.88578313253015,58,7,8.2857142857142865,{"$f":"MIN($F40:U40)","v":0},"Да",6,29,"ОК"]
{"$rows_left_out":71}
{"sheet":"Данные","index":1,"n_rows":703,"n_cols":23,"rows_kept":703,"cut":false,"hidden":true,"merged":[]}
["ID","Оценка из 10 баллов до пересдач","Группа","Студент","Фамилия","Имя","Отчество","Номер студенческого билета","Строка учебного плана","Текущих кредитов за испытание","Вид испытания","Календарный период по плану","Неявка до пересдач","В текущий рейтинг","Текущих кредитов для студента","Оценка зачет/незачет до пересдач","Является бюджетным","Учебный план","Вид записи РУП","Вид записи ИУП","Номер Row"]
[1,2,3,4,5,6,7,8,9,10,11,12,13,14,15,16,17,18,19,20,21]
[1258676458,3,"БЖУР133",475563206,"Малышева","Ирина","Александровна","1301219056","Документы и презентации в LaTeX",0,"Экзамен","2015/2016 учебный год 1 модуль",null,0,0,0,1,1236130895,2098,null,"stFacultative","Журналистика",{"$f":"MATCH(D3,Отчет!$C:$C,0)","v":44}]
[1258676425,0,"БЖУР133",475501916,"Чернышева","Евгения","Эдуардовна","1301219103","Документы и презентации в LaTeX",0,"Экзамен","2015/2016 учебный год 1 модуль",null,0,0,0,1,1236130895,2098,null,"stFacultative","Журналистика",{"$f":"MATCH(D4,Отчет!$C:$C,0)","v":32}]
[1164708175,null,"БЖУР134",475564380,"Алешкина","Александрина","Александровна","231210002","Информационные технологии подготовки печатных и электронных СМИ",3,"Экзамен","2015/2016 учебный год 1 модуль",0,0,3,null,0,1014950343,2098,"ikFirst","stCommon","Журналистика",{"$f":"MATCH(D5,Отчет!$C:$C,0)","v":109}]
[1164842108,6,"БЖУР131",615125946,"Халилова","Арзу","Идаятовна","131232230","Информационные технологии подготовки печатных и электронных СМИ",3,"Экзамен","2015/2016 учебный год 1 модуль",null,18,3,1,0,1014950343,2098,"ikFirst","stCommon","Журналистика",{"$f":"MATCH(D6,Отчет!$C:$C,0)","v":89}]
[1164833617,6,"БЖУР131",580462633,"Немкова","Екатерина","Дмитриевна","131232209","Информационные технологии подготовки печатных и электронных СМИ",3,"Экзамен","2015/2016 учебный год 1 модуль",null,18,3,1,0,1014950343,2098,"ikFirst","stCommon","Журналистика",{"$f":"MATCH(D7,Отчет!$C:$C,0)","v":91}]
[1258676628,null,"БЖУР132",481500835,"Цегалко","Яна","Николаевна","1311219101","Мода, костюм, личность: человек и его одежда в общественном пространстве",0,"Экзамен","2015/2016 учебный год 1 модуль",null,0,0,null,0,1236130895,2098,null,"stFacultative","Журналистика",{"$f":"MATCH(D8,Отчет!$C:$C,0)","v":40}]
[1258676510,null,"БЖУР132",475498195,"Булатова","Катерина","Николаевна","1301219012","Мода, костюм, личность: человек и его одежда в общественном пространстве",0,"Экзамен","2015/2016 учебный год 1 модуль",null,0,0,null,1,1236130895,2098,null,"stFacultative","Журналистика",{"$f":"MATCH(D9,Отчет!$C:$C,0)","v":23}]
[1025718952,8,"БЖУР134",481505154,"Швецова","Екатерина","Константиновна","1311219105","Первая производственная практика",0,"Экзамен","2015/2016 учебный год 1 модуль",null,0,0,1,0,1025645129,4347,null,null,"Журналистика",{"$f":"MATCH(D10,Отчет!$C:$C,0)","v":75}]
[1025718788,10,"БЖУР131",580462633,"Немкова","Екатерина","Дмитриевна","131232209","Первая производственная практика",0,"Экзамен","2015/2016 учебный год 1 модуль",null,0,0,1,0,1025645129,4347,"ikPlanned",null,"Журналистика",{"$f":"MATCH(D11,Отчет!$C:$C,0)","v":91}]
[1025716770,10,"БЖУР131",615125946,"Халилова","Арзу","Идаятовна","131232230","Первая производственная практика",0,"Экзамен","2015/2016 учебный год 1 модуль",null,0,0,1,0,1025645129,4347,"ikPlanned",null,"Журналистика",{"$f":"MATCH(D12,Отчет!$C:$C,0)","v":89}]
[1025717806,null,"БЖУР131",752764364,"Масалова","Анна","Владиславовна","131232133","Первая производственная практика",0,"Экзамен","2015/2016 учебный год 1 модуль",0,0,0,null,0,1025645129,4347,"ikPlanned",null,"Журналистика",{"$f":"MATCH(D13,Отчет!$C:$C,0)","v":53}]
[1025717484,9,"БЖУР131",796834861,"Тесфайе","Анна-Мария","Синтайе","10701175","Первая производственная практика",0,"Экзамен","2015/2016 учебный год 1 модуль",null,0,0,1,0,1025645129,4347,"ikPlanned",null,"Журналистика",{"$f":"MATCH(D14,Отчет!$C:$C,0)","v":107}]
[1025717559,10,"БЖУР134",475565084,"Зражаева","Алина","Сергеевна","1311219036","Первая производственная практика",0,"Экзамен","2015/2016 учебный год 1 модуль",null,0,0,1,0,1025645129,4347,null,null,"Журналистика",{"$f":"MATCH(D15,Отчет!$C:$C,0)","v":20}]
[1025723096,9,"БЖУР134",475565231,"Макарова","Юлия","Валерьевна","1311219054","Первая производственная практика",0,"Экзамен","2015/2016 учебный год 1 модуль",null,0,0,1,0,1025645129,4347,null,null,"Журналистика",{"$f":"MATCH(D16,Отчет!$C:$C,0)","v":66}]
[1025720713,9,"БЖУР134",475565410,"Маленкова","Мария","Александровна","1301219055","Первая производственная практика",0,"Экзамен","2015/2016 учебный год 1 модуль",null,0,0,1,1,1025645129,4347,null,null,"Журналистика",{"$f":"MATCH(D17,Отчет!$C:$C,0)","v":36}]
[1025716251,10,"БЖУР134",475565551,"Нарушевич","Анастасия","Александровна","1311219065","Первая производственная практика",0,"Экзамен","2015/2016 учебный год 1 модуль",null,0,0,1,0,1025645129,4347,null,null,"Журналистика",{"$f":"MATCH(D18,Отчет!$C:$C,0)","v":80}]
[1025716591,9,"БЖУР134",475565869,"Стешенкова","Александра","Евгеньевна","1301219088","Первая производственная практика",0,"Экзамен","2015/2016 учебный год 1 модуль",null,0,0,1,1,1025645129,4347,null,null,"Журналистика",{"$f":"MATCH(D19,Отчет!$C:$C,0)","v":39}]
[1025722181,10,"БЖУР131",481496658,"Афанасьева","Татьяна","Валерьевна","1311219005","Первая производственная практика",0,"Экзамен","2015/2016 учебный год 1 модуль",null,0,0,1,0,1025645129,4347,null,null,"Журналистика",{"$f":"MATCH(D20,Отчет!$C:$C,0)","v":30}]
[1025716506,8,"БЖУР131",481496795,"Ероносов","Александр","Эдуардович","1311219034","Первая производственная практика",0,"Экзамен","2015/2016 учебный год 1 модуль",null,0,0,1,0,1025645129,4347,null,null,"Журналистика",{"$f":"MATCH(D21,Отчет!$C:$C,0)","v":72}]
[1192671046,8,"БЖУР131",481496924,"Зубкевич","Андрей","Вадимович","1311219037","Первая производственная практика",0,"Экзамен","2015/2016 учебный год 1 модуль",null,0,0,1,0,1025645129,4347,null,null,"Журналистика",{"$f":"MATCH(D22,Отчет!$C:$C,0)","v":97}]
[1025721188,9,"БЖУР131",481497225,"Морозова","Николь","Дмитриевна","1311219062","Первая производственная практика",0,"Экзамен","2015/2016 учебный год 1 модуль",null,0,0,1,0,1025645129,4347,null,null,"Журналистика",{"$f":"MATCH(D23,Отчет!$C:$C,0)","v":69}]
[1025716170,9,"БЖУР131",481497357,"Муратова","Анастасия","Александровна","1311219063","Первая производственная практика",0,"Экзамен","2015/2016 учебный год 1 модуль",null,0,0,1,0,1025645129,4347,null,null,"Журналистика",{"$f":"MATCH(D24,Отчет!$C:$C,0)","v":77}]
[1025718266,8,"БЖУР131",481497484,"Нещадимова","Дарья","Викторовна","1311219067","Первая производственная практика",0,"Экзамен","2015/2016 учебный год 1 модуль",null,0,0,1,0,1025645129,4347,null,null,"Журналистика",{"$f":"MATCH(D25,Отчет!$C:$C,0)","v":19}]
[1162510676,9,"БЖУР132",481498934,"Глазунов","Никита","Сергеевич","116-24/12-036","Первая производственная практика",0,"Экзамен","2015/2016 учебный год 1 модуль",null,0,0,1,0,1025645129,4347,"ikPlanned",null,"Журналистика",{"$f":"MATCH(D26,Отчет!$C:$C,0)","v":102}]
[1025722039,9,"БЖУР132",481499019,"Голованов","Сергей","Сергеевич","1311219022","Первая производственная практика",0,"Экзамен","2015/2016 учебный год 1 модуль",null,0,0,1,0,1025645129,4347,null,null,"Журналистика",{"$f":"MATCH(D27,Отчет!$C:$C,0)","v":51}]
[1025722659,8,"БЖУР132",481499520,"Королева","Виолетта","Николаевна","1311219043","Первая производственная практика",0,"Экзамен","2015/2016 учебный год 1 модуль",null,0,0,1,0,1025645129,4347,null,null,"Журналистика",{"$f":"MATCH(D28,Отчет!$C:$C,0)","v":81}]
[1025718715,10,"БЖУР132",481499652,"Королькова","Елизавета","Дмитриевна","1311219045","Первая производственная практика",0,"Экзамен","2015/2016 учебный год 1 модуль",null,0,0,1,0,1025645129,4347,null,null,"Журналистика",{"$f":"MATCH(D29,Отчет!$C:$C,0)","v":43}]
[1025720106,9,"БЖУР132",481500039,"Лебедева","Ксения","Кирилловна","1311219048","Первая производственная практика",0,"Экзамен","2015/2016 учебный год 1 модуль",null,0,0,1,0,1025645129,4347,null,null,"Журналистика",{"$f":"MATCH(D30,Отчет!$C:$C,0)","v":28}]
[1192671273,10,"БЖУР132",481500235,"Немченко","Илья","Михайлович","1311219066","Первая производственная практика",0,"Экзамен","2015/2016 учебный год 1 модуль",null,0,0,1,0,1025645129,4347,null,null,"Журналистика",{"$f":"MATCH(D31,Отчет!$C:$C,0)","v":88}]
[1192671391,10,"БЖУР132",481500392,"Павлова","Алиса","Павловна","1311219071","Первая производственная практика",0,"Экзамен","2015/2016 учебный год 1 модуль",null,0,0,1,0,1025645129,4347,null,null,"Журналистика",{"$f":"MATCH(D32,Отчет!$C:$C,0)","v":59}]
[1025717399,10,"БЖУР132",481500535,"Правдюк","Анна","Сергеевна","1311219075","Первая производственная практика",0,"Экзамен","2015/2016 учебный год 1 модуль",null,0,0,1,0,1025645129,4347,null,null,"Журналистика",{"$f":"MATCH(D33,Отчет!$C:$C,0)","v":13}]
[1025716999,10,"БЖУР132",481500688,"Ревоненко","Анна","Николаевна","1311219078","Первая производственная практика",0,"Экзамен","2015/2016 учебный год 1 модуль",null,0,0,1,0,1025645129,4347,null,null,"Журналистика",{"$f":"MATCH(D34,Отчет!$C:$C,0)","v":24}]
[1025722803,10,"БЖУР132",481500835,"Цегалко","Яна","Николаевна","1311219101","Первая производственная практика",0,"Экзамен","2015/2016 учебный год 1 модуль",null,0,0,1,0,1025645129,4347,null,null,"Журналистика",{"$f":"MATCH(D35,Отчет!$C:$C,0)","v":40}]
[1192672881,8,"БЖУР133",481501546,"Атасунцев","Александр","Григорьевич","1311219004","Первая производственная практика",0,"Экзамен","2015/2016 учебный год 1 модуль",null,0,0,1,0,1025645129,4347,null,null,"Журналистика",{"$f":"MATCH(D36,Отчет!$C:$C,0)","v":98}]
[1192672950,9,"БЖУР133",481501825,"Лымарева","Мария","Андреевна","1311219052","Первая производственная практика",0,"Экзамен","2015/2016 учебный год 1 модуль",null,0,0,1,0,1025645129,4347,null,null,"Журналистика",{"$f":"MATCH(D37,Отчет!$C:$C,0)","v":73}]
[1025716074,10,"БЖУР133",481501975,"Молоствова","Анна","Александровна","1311219061","Первая производственная практика",0,"Экзамен","2015/2016 учебный год 1 модуль",null,0,0,1,0,1025645129,4347,null,null,"Журналистика",{"$f":"MATCH(D38,Отчет!$C:$C,0)","v":15}]
[1025722558,10,"БЖУР133",481502112,"Сидоров","Всеволод","Дмитриевич","1311219085","Первая производственная практика",0,"Экзамен","2015/2016 учебный год 1 модуль",null,0,0,1,0,1025645129,4347,null,null,"Журналистика",{"$f":"MATCH(D39,Отчет!$C:$C,0)","v":45}]
[1025719418,10,"БЖУР133",481502259,"Титов","Игорь","Игоревич","1311219092","Первая производственная практика",0,"Экзамен","2015/2016 учебный год 1 модуль",null,0,0,1,0,1025645129,4347,null,null,"Журналистика",{"$f":"MATCH(D40,Отчет!$C:$C,0)","v":61}]
{"$rows_left_out":663}