{"text_format":"1","workbook":"xlsx","n_sheets":2,"sheets":["Отчет","Данные"],"not_rendered":{"charts":0,"images":1,"macros":1,"external_links":0,"defined_names":0,"comments":0,"pivot_tables":0},"unopened":[],"bounds":{"document_bytes":16777216,"sheet_cells":100000,"rows_first":2000,"rows_last":500,"rows_between":2000,"halvings":0,"cell_chars":16384,"cell_head_chars":4096},"cells_cut":0,"cells_raw":0,"read":"whole","date_system":"1900"}

{"sheet":"Отчет","index":0,"n_rows":122,"n_cols":23,"rows_kept":122,"cut":false,"hidden":false,"merged":[[7,21,10,21],[10,0,10,4],[7,20,10,20],[7,11,10,11],[7,14,10,14],[7,0,9,0],[7,19,10,19],[7,12,10,12],[11,0,12,0],[7,2,9,2],[0,17,0,20],[7,18,10,18],[7,16,10,16],[7,3,9,3],[7,15,10,15],[1,17,2,20],[7,13,10,13],[7,1,9,1],[7,4,9,4],[7,17,10,17],[7,5,7,6],[8,5,8,6],[8,7,8,9],[7,7,7,10],[69,0,70,0],[13,0,17,0],[18,0,26,0],[27,0,29,0],[30,0,35,0],[38,0,39,0],[40,0,44,0],[46,0,52,0],[53,0,56,0],[58,0,60,0],[61,0,66,0],[67,0,68,0],[116,0,118,0],[71,0,73,0],[74,0,77,0],[80,0,83,0],[84,0,86,0],[87,0,90,0],[93,0,94,0],[95,0,96,0],[97,0,98,0],[99,0,100,0],[103,0,106,0],[107,0,111,0]]}
["Текущий рейтинг студентов (до пересдач)",null,null,null,null,null,null,null,null,null,null,null,null,null,null,null,null,"Приложение 3"]
["Дата выгрузки: 20.01.2016",null,null,null,null,null,null,null,null,null,null,null,null,null,null,null,null,"к Положению о рейтинговой системе комплексной оценки знаний студентов "]
["Период: c 2015/2016 учебный год I семестр по 2015/2016 учебный год I семестр"]
["Факультет/отделение: Факультет коммуникаций, медиа и дизайна"]
["Направление подготовки: Журналистика"]
["Уровень образования, номер курса: Бакалавриат 4 курс",null,null,null,null,null," - студенты имеющие задолженности"]
[null,null,null,null,null,"*"," - изучение по ИУП"]
["Место","Студент","ID","Группа","Образовательная программа студента","2015/2016 учебный год 1 модуль",null,"2015/2016 учебный год 2 модуль",null,null,null,"Кредитно-рейтинговая оценка","Нормировочный коэффициент","Сумма всех кредитов ","Нормированная кредитно-рейтинговая оценка","Сумма всех оценок","Количество всех оценок","Средний балл","Минимальный балл","Наличие неудовлетворительных оценок и неявок","Количество удовлетворительных оценок","Номер места"]
[null,null,null,null,null,"Экзамен",null,"Экзамен",null,null,"Зачет"]
[null,null,null,null,null,"Вторая производственная практика","Информационные технологии подготовки печатных и электронных СМИ","Исследование медиа-процессов","История и теория литературы","Политическая журналистика","Физическая культура"]
["Число текущих кредитов:",null,null,null,null,0,3,1.05,6,7,0.44]
["1 - 2","Ивлиева Маргарита Дмитриевна",481528286,"БЖУР124","Журналистика",10,null,null,10,10,10,134.4,{"$f":"IF(N12 > 0, MAX(N$12:N$122) / N12, 0)","v":1.2232142857142858},13.44,{"$f":"L12*M12","v":164.4},40,4,{"$f":"IF(Q12 > 0,P12/Q12,0)","v":10},{"$f":"MIN($F12:K12)","v":10},null,4,1,"ОК"]
[null,"Миннуллина Екатерина Маратовна",481515713,"БЖУР122","Журналистика",10,null,null,10,10,10,134.4,1.2232142857142858,13.44,164.4,40,4,10,{"$f":"MIN($F13:K13)","v":10},null,4,2,"ОК"]
["3 - 7","Воронкова Алена Борисовна",481512248,"БЖУР122","Журналистика",10,null,null,9,10,10,128.4,1.2232142857142858,13.44,157.06071428571431,39,4,9.75,{"$f":"MIN($F14:K14)","v":9},null,4,3,"ОК"]
[null,"Головач Евгения Максимовна",481512855,"БЖУР122","Журналистика",10,null,null,9,10,10,128.4,1.2232142857142858,13.44,157.06071428571431,39,4,9.75,{"$f":"MIN($F15:K15)","v":9},null,4,4,"ОК"]
[null,"Козкина Анна Леонидовна",481514993,"БЖУР122","Журналистика",10,null,null,9,10,10,128.4,1.2232142857142858,13.44,157.06071428571431,39,4,9.75,{"$f":"MIN($F16:K16)","v":9},null,4,5,"ОК"]
[null,"Пиянзина Мария Сергеевна",481508707,"БЖУР121","Журналистика",9,null,null,9,10,10,128.4,1.2232142857142858,13.44,157.06071428571431,38,4,9.5,{"$f":"MIN($F17:K17)","v":9},null,4,6,"ОК"]
[null,"Лобзова Евгения Константиновна",475514009,"БЖУР124","Журналистика",7,null,null,9,10,10,128.4,1.2232142857142858,13.44,157.06071428571431,36,4,9,{"$f":"MIN($F18:K18)","v":7},null,4,7,"ОК"]
["8 - 16","Долинина Ирина Николаевна",475508457,"БЖУР122","Журналистика",10,null,null,10,9,10,127.4,1.2232142857142858,13.44,155.83750000000001,39,4,9.75,{"$f":"MIN($F19:K19)","v":9},null,4,8,"ОК"]
[null,"Мароховская Алеся Алексеевна",475514276,"БЖУР124","Журналистика",10,null,null,10,9,10,127.4,1.2232142857142858,13.44,155.83750000000001,39,4,9.75,{"$f":"MIN($F20:K20)","v":9},null,4,9,"ОК"]
[null,"Радина Алена Альбертовна",481525662,"БЖУР123","Журналистика",10,null,null,10,9,10,127.4,1.2232142857142858,13.44,155.83750000000001,39,4,9.75,{"$f":"MIN($F21:K21)","v":9},null,4,10,"ОК"]
[null,"Рябцева Наталия  Викторовна",481529293,"БЖУР124","Журналистика",10,null,null,10,9,10,127.4,1.2232142857142858,13.44,155.83750000000001,39,4,9.75,{"$f":"MIN($F22:K22)","v":9},null,4,11,"ОК"]
[null,"Тарасова Екатерина Сергеевна",475515356,"БЖУР124","Журналистика",10,null,null,10,9,10,127.4,1.2232142857142858,13.44,155.83750000000001,39,4,9.75,{"$f":"MIN($F23:K23)","v":9},null,4,12,"ОК"]
[null,"Черных Виктория Николаевна",475573015,"БЖУР121","Журналистика",10,null,null,10,9,10,127.4,1.2232142857142858,13.44,155.83750000000001,39,4,9.75,{"$f":"MIN($F24:K24)","v":9},null,4,13,"ОК"]
[null,"Румянцева Мария Андреевна",481529012,"БЖУР124","Журналистика",9,null,null,10,9,10,127.4,1.2232142857142858,13.44,155.83750000000001,38,4,9.5,{"$f":"MIN($F25:K25)","v":9},null,4,14,"ОК"]
[null,"Шепелёв Дмитрий Алексеевич",475516186,"БЖУР124","Журналистика",9,null,null,10,9,10,127.4,1.2232142857142858,13.44,155.83750000000001,38,4,9.5,{"$f":"MIN($F26:K26)","v":9},null,4,15,"ОК"]
[null,"Чунова Александра Владимировна",475515912,"БЖУР124","Журналистика",8,null,null,10,9,10,127.4,1.2232142857142858,13.44,155.83750000000001,37,4,9.25,{"$f":"MIN($F27:K27)","v":8},null,4,16,"ОК"]
["17 - 19","Малюк Татьяна Дмитриевна",475506053,"БЖУР121","Журналистика",10,null,null,8,10,10,122.4,1.2232142857142858,13.44,149.72142857142859,38,4,9.5,{"$f":"MIN($F28:K28)","v":8},null,4,17,"ОК"]
[null,"Савин Павел Дмитриевич",481509017,"БЖУР121","Журналистика",10,null,null,8,10,10,122.4,1.2232142857142858,13.44,149.72142857142859,38,4,9.5,{"$f":"MIN($F29:K29)","v":8},null,4,18,"ОК"]
[null,"Сидненко Алеся Александровна",481509290,"БЖУР121","Журналистика",10,null,null,8,10,10,122.4,1.2232142857142858,13.44,149.72142857142859,38,4,9.5,{"$f":"MIN($F30:K30)","v":8},null,4,19,"ОК"]
["20 - 25","Грачева Дарья Сергеевна",475575725,"БЖУР123","Журналистика",10,null,null,9,9,10,121.4,1.2232142857142858,13.44,148.49821428571431,38,4,9.5,{"$f":"MIN($F31:K31)","v":9},null,4,20,"ОК"]
[null,"Ибрагимова Элина Рустемовна",481513639,"БЖУР122","Журналистика",10,null,null,9,9,10,121.4,1.2232142857142858,13.44,148.49821428571431,38,4,9.5,{"$f":"MIN($F32:K32)","v":9},null,4,21,"ОК"]
[null,"Слюсаренко Дарья Сергеевна",475514804,"БЖУР124","Журналистика",10,null,null,9,9,10,121.4,1.2232142857142858,13.44,148.49821428571431,38,4,9.5,{"$f":"MIN($F33:K33)","v":9},null,4,22,"ОК"]
[null,"Устюгова Екатерина Вадимовна",481510230,"БЖУР121","Журналистика",10,null,null,9,9,10,121.4,1.2232142857142858,13.44,148.49821428571431,38,4,9.5,{"$f":"MIN($F34:K34)","v":9},null,4,23,"ОК"]
[null,"Голенкова Екатерина Викторовна",481527213,"БЖУР124","Журналистика",9,null,null,9,9,10,121.4,1.2232142857142858,13.44,148.49821428571431,37,4,9.25,{"$f":"MIN($F35:K35)","v":9},null,4,24,"ОК"]
[null,"Юртов Тимофей Матвеевич",481529559,"БЖУР124","Журналистика",7,null,null,9,9,10,121.4,1.2232142857142858,13.44,148.49821428571431,35,4,8.75,{"$f":"MIN($F36:K36)","v":7},null,4,25,"ОК"]
[26,"Сидоркова Инна Сергеевна",475511255,"БЖУР123","Журналистика",10,null,null,10,8,10,120.4,1.2232142857142858,13.44,147.27500000000001,38,4,9.5,{"$f":"MIN($F37:K37)","v":8},null,4,26,"ОК"]
[27,"Соколов Никита Алексеевич",475515075,"БЖУР124","Журналистика",9,null,null,7,10,10,116.4,1.2232142857142858,13.44,142.38214285714287,36,4,9,{"$f":"MIN($F38:K38)","v":7},null,4,27,"ОК"]
["28 - 29","Соболевская Анастасия Павловна",481509618,"БЖУР121","Журналистика",10,null,null,8,9,10,115.4,1.2232142857142858,13.44,141.15892857142859,37,4,9.25,{"$f":"MIN($F39:K39)","v":8},null,4,28,"ОК"]
[null,"Гречаная Тамара Владимировна",475510314,"БЖУР123","Журналистика",9,null,null,8,9,10,115.4,1.2232142857142858,13.44,141.15892857142859,36,4,9,{"$f":"MIN($F40:K40)","v":8},null,4,29,"ОК"]
{"$rows_left_out":83}
{"sheet":"Данные","index":1,"n_rows":448,"n_cols":23,"rows_kept":448,"cut":false,"hidden":true,"merged":[]}
["ID","Оценка из 10 баллов до пересдач","Группа","Студент","Фамилия","Имя","Отчество","Номер студенческого билета","Строка учебного плана","Текущих кредитов за испытание","Вид испытания","Календарный период по плану","Неявка до пересдач","В текущий рейтинг","Текущих кредитов для студента","Оценка зачет/незачет до пересдач","Является бюджетным","Учебный план","Вид записи РУП","Вид записи ИУП","Номер Row"]
[1,2,3,4,5,6,7,8,9,10,11,12,13,14,15,16,17,18,19,20,21]
[1025732116,null,"БЖУР121",475572032,"Петров","Роман","Евгеньевич","121219060","Вторая производственная практика",0,"Экзамен","2015/2016 учебный год 1 модуль",0,0,0,null,0,1025647437,4347,null,null,"Журналистика",{"$f":"MATCH(D3,Отчет!$C:$C,0)","v":119}]
[1025724941,8,"БЖУР121",475572360,"Умецкая","Анастасия","Ильинична","121219087","Вторая производственная практика",0,"Экзамен","2015/2016 учебный год 1 модуль",null,0,0,1,0,1025647437,4347,null,null,"Журналистика",{"$f":"MATCH(D4,Отчет!$C:$C,0)","v":56}]
[1025733466,10,"БЖУР121",475573015,"Черных","Виктория","Николаевна","120219096","Вторая производственная практика",0,"Экзамен","2015/2016 учебный год 1 модуль",null,0,0,1,1,1025647437,4347,null,null,"Журналистика",{"$f":"MATCH(D5,Отчет!$C:$C,0)","v":24}]
[1025724341,8,"БЖУР122",475573890,"Семихина","Анна","Андреевна","1211232056","Вторая производственная практика",0,"Экзамен","2015/2016 учебный год 1 модуль",null,0,0,1,0,1025647437,4347,null,null,"Журналистика",{"$f":"MATCH(D6,Отчет!$C:$C,0)","v":52}]
[1025729006,9,"БЖУР122",475574160,"Толоконников","Иван","Александрович","1114193","Вторая производственная практика",0,"Экзамен","2015/2016 учебный год 1 модуль",null,0,0,1,0,1025647437,4347,null,null,"Журналистика",{"$f":"MATCH(D7,Отчет!$C:$C,0)","v":109}]
[1025728768,null,"БЖУР122",475574645,"Цыбулина","Елизавета","Юрьевна","121219093","Вторая производственная практика",0,"Экзамен","2015/2016 учебный год 1 модуль",1,0,0,null,0,1025647437,4347,null,null,"Журналистика",{"$f":"MATCH(D8,Отчет!$C:$C,0)","v":121}]
[1025733213,10,"БЖУР123",475575058,"Алишова","Таиса","Шаиг кызы","120219003","Вторая производственная практика",0,"Экзамен","2015/2016 учебный год 1 модуль",null,0,0,1,1,1025647437,4347,null,null,"Журналистика",{"$f":"MATCH(D9,Отчет!$C:$C,0)","v":88}]
[1025732513,9,"БЖУР123",475575387,"Закружный","Семен","Викторович","121219031","Вторая производственная практика",0,"Экзамен","2015/2016 учебный год 1 модуль",null,0,0,1,0,1025647437,4347,"ikPlanned",null,"Журналистика",{"$f":"MATCH(D10,Отчет!$C:$C,0)","v":116}]
[1025726772,10,"БЖУР123",475575725,"Грачева","Дарья","Сергеевна","1311219116","Вторая производственная практика",0,"Экзамен","2015/2016 учебный год 1 модуль",null,0,0,1,0,1025647437,4347,null,null,"Журналистика",{"$f":"MATCH(D11,Отчет!$C:$C,0)","v":31}]
[1025725127,8,"БЖУР124",475576790,"Анисимов","Артемий","Михайлович","121219004","Вторая производственная практика",0,"Экзамен","2015/2016 учебный год 1 модуль",null,0,0,1,0,1025647437,4347,null,null,"Журналистика",{"$f":"MATCH(D12,Отчет!$C:$C,0)","v":70}]
[1025723753,10,"БЖУР121",475503952,"Адаричева","Анна","Андреевна","120219002","Вторая производственная практика",0,"Экзамен","2015/2016 учебный год 1 модуль",null,0,0,1,1,1025647437,4347,null,null,"Журналистика",{"$f":"MATCH(D13,Отчет!$C:$C,0)","v":120}]
[1025726931,10,"БЖУР121",475504262,"Долина","Евгения","Александровна","120219025","Вторая производственная практика",0,"Экзамен","2015/2016 учебный год 1 модуль",null,0,0,1,1,1025647437,4347,null,null,"Журналистика",{"$f":"MATCH(D14,Отчет!$C:$C,0)","v":47}]
[1192670319,9,"БЖУР121",475504558,"Игнатьева","Маргарита","Маратовна","120219037","Вторая производственная практика",0,"Экзамен","2015/2016 учебный год 1 модуль",null,0,0,1,1,1025647437,4347,null,null,"Журналистика",{"$f":"MATCH(D15,Отчет!$C:$C,0)","v":76}]
[1025723911,10,"БЖУР121",475504841,"Карчебанова","Алена","Алексеевна","120219040","Вторая производственная практика",0,"Экзамен","2015/2016 учебный год 1 модуль",null,0,0,1,1,1025647437,4347,null,null,"Журналистика",{"$f":"MATCH(D16,Отчет!$C:$C,0)","v":113}]
[1025725883,10,"БЖУР121",475505148,"Колесникова","Анастасия","Сергеевна","120219043","Вторая производственная практика",0,"Экзамен","2015/2016 учебный год 1 модуль",null,0,0,1,1,1025647437,4347,null,null,"Журналистика",{"$f":"MATCH(D17,Отчет!$C:$C,0)","v":41}]
[1025731805,10,"БЖУР121",475505469,"Кузьмина","Ольга","Валерьевна","120219045","Вторая производственная практика",0,"Экзамен","2015/2016 учебный год 1 модуль",null,0,0,1,1,1025647437,4347,null,null,"Журналистика",{"$f":"MATCH(D18,Отчет!$C:$C,0)","v":42}]
[1025727736,10,"БЖУР121",475505755,"Логинова","Елена","Михайловна","120219049","Вторая производственная практика",0,"Экзамен","2015/2016 учебный год 1 модуль",null,0,0,1,1,1025647437,4347,null,null,"Журналистика",{"$f":"MATCH(D19,Отчет!$C:$C,0)","v":86}]
[1025732691,10,"БЖУР121",475506053,"Малюк","Татьяна","Дмитриевна","120219052","Вторая производственная практика",0,"Экзамен","2015/2016 учебный год 1 модуль",null,0,0,1,1,1025647437,4347,null,null,"Журналистика",{"$f":"MATCH(D20,Отчет!$C:$C,0)","v":28}]
[1192670431,10,"БЖУР121",475506339,"Негря","Валерия","Олеговна","120219194","Вторая производственная практика",0,"Экзамен","2015/2016 учебный год 1 модуль",null,0,0,1,1,1025647437,4347,null,null,"Журналистика",{"$f":"MATCH(D21,Отчет!$C:$C,0)","v":46}]
[1025724719,10,"БЖУР121",475506618,"Сулеева","Амина","Эдировна","120219193","Вторая производственная практика",0,"Экзамен","2015/2016 учебный год 1 модуль",null,0,0,1,1,1025647437,4347,null,null,"Журналистика",{"$f":"MATCH(D22,Отчет!$C:$C,0)","v":62}]
[1025733971,10,"БЖУР121",475506879,"Токмаш","Юрие","-","120219194","Вторая производственная практика",0,"Экзамен","2015/2016 учебный год 1 модуль",null,0,0,1,1,1025647437,4347,null,null,"Журналистика",{"$f":"MATCH(D23,Отчет!$C:$C,0)","v":63}]
[1025725441,10,"БЖУР121",475507222,"Уродов","Андрей","Николаевич","120219088","Вторая производственная практика",0,"Экзамен","2015/2016 учебный год 1 модуль",null,0,0,1,1,1025647437,4347,null,null,"Журналистика",{"$f":"MATCH(D24,Отчет!$C:$C,0)","v":64}]
[1025730103,10,"БЖУР121",475507521,"Эльзенбах","Мария","Андреевна","120219103","Вторая производственная практика",0,"Экзамен","2015/2016 учебный год 1 модуль",null,0,0,1,1,1025647437,4347,null,null,"Журналистика",{"$f":"MATCH(D25,Отчет!$C:$C,0)","v":65}]
[1025733882,10,"БЖУР122",475508143,"Белякова","Яна","Романовна","120219006","Вторая производственная практика",0,"Экзамен","2015/2016 учебный год 1 модуль",null,0,0,1,1,1025647437,4347,null,null,"Журналистика",{"$f":"MATCH(D26,Отчет!$C:$C,0)","v":96}]
[1025729238,10,"БЖУР122",475508457,"Долинина","Ирина","Николаевна","120219026","Вторая производственная практика",0,"Экзамен","2015/2016 учебный год 1 модуль",null,0,0,1,1,1025647437,4347,null,null,"Журналистика",{"$f":"MATCH(D27,Отчет!$C:$C,0)","v":19}]
[1025731184,10,"БЖУР122",475508769,"Погосян","Марина","Ваграмовна","120219062","Вторая производственная практика",0,"Экзамен","2015/2016 учебный год 1 модуль",null,0,0,1,1,1025647437,4347,null,null,"Журналистика",{"$f":"MATCH(D28,Отчет!$C:$C,0)","v":59}]
[1025733773,10,"БЖУР122",475509036,"Спиранде","Валерия","Юрьевна","120219082","Вторая производственная практика",0,"Экзамен","2015/2016 учебный год 1 модуль",null,0,0,1,1,1025647437,4347,null,null,"Журналистика",{"$f":"MATCH(D29,Отчет!$C:$C,0)","v":58}]
[1025724651,10,"БЖУР122",475509307,"Тавлуева","Алина","Дмитриевна","130219200","Вторая производственная практика",0,"Экзамен","2015/2016 учебный год 1 модуль",null,0,0,1,1,1025647437,4347,null,null,"Журналистика",{"$f":"MATCH(D30,Отчет!$C:$C,0)","v":108}]
[1025733287,9,"БЖУР123",475510314,"Гречаная","Тамара","Владимировна","120219019","Вторая производственная практика",0,"Экзамен","2015/2016 учебный год 1 модуль",null,0,0,1,1,1025647437,4347,null,null,"Журналистика",{"$f":"MATCH(D31,Отчет!$C:$C,0)","v":40}]
[1025726700,10,"БЖУР123",475510622,"Касянчук","Денис","Евгеньевич","120219041","Вторая производственная практика",0,"Экзамен","2015/2016 учебный год 1 модуль",null,0,0,1,1,1025647437,4347,null,null,"Журналистика",{"$f":"MATCH(D32,Отчет!$C:$C,0)","v":99}]
[1025730823,9,"БЖУР123",475510931,"Куреша","Мария","Олеговна","120219047","Вторая производственная практика",0,"Экзамен","2015/2016 учебный год 1 модуль",null,0,0,1,1,1025647437,4347,null,null,"Журналистика",{"$f":"MATCH(D33,Отчет!$C:$C,0)","v":94}]
[1025729360,10,"БЖУР123",475511255,"Сидоркова","Инна","Сергеевна","121219075","Вторая производственная практика",0,"Экзамен","2015/2016 учебный год 1 модуль",null,0,0,1,1,1025647437,4347,null,null,"Журналистика",{"$f":"MATCH(D34,Отчет!$C:$C,0)","v":37}]
[1025727230,7,"БЖУР123",475511562,"Степаненкова","Екатерина","Дмитриевна","120219083","Вторая производственная практика",0,"Экзамен","2015/2016 учебный год 1 модуль",null,0,0,1,1,1025647437,4347,null,null,"Журналистика",{"$f":"MATCH(D35,Отчет!$C:$C,0)","v":95}]
[1025731604,9,"БЖУР123",475511861,"Устинова","Надежда","Владимировна","120219089","Вторая производственная практика",0,"Экзамен","2015/2016 учебный год 1 модуль",null,0,0,1,1,1025647437,4347,null,null,"Журналистика",{"$f":"MATCH(D36,Отчет!$C:$C,0)","v":97}]
[1025732293,10,"БЖУР123",475512367,"Феоктистова","Софья","Эдуардовна","120219091","Вторая производственная практика",0,"Экзамен","2015/2016 учебный год 1 модуль",null,0,0,1,1,1025647437,4347,null,null,"Журналистика",{"$f":"MATCH(D37,Отчет!$C:$C,0)","v":68}]
[1025733558,null,"БЖУР123",475512687,"Шведов","Владимир","Сергеевич","120219099","Вторая производственная практика",0,"Экзамен","2015/2016 учебный год 1 модуль",0,0,0,null,1,1025647437,4347,null,null,"Журналистика",{"$f":"MATCH(D38,Отчет!$C:$C,0)","v":84}]
[1025725283,null,"БЖУР124",475513250,"Боровиков","Антон","Николаевич","120219008","Вторая производственная практика",0,"Экзамен","2015/2016 учебный год 1 модуль",0,0,0,null,1,1025647437,4347,null,null,"Журналистика",{"$f":"MATCH(D39,Отчет!$C:$C,0)","v":66}]
[1146623184,8,"БЖУР124",475513758,"Курганская","Анастасия","Сергеевна","120219046","Вторая производственная практика",0,"Экзамен","2015/2016 учебный год 1 модуль",null,0,0,1,1,1025647437,4347,null,null,"Журналистика",{"$f":"MATCH(D40,Отчет!$C:$C,0)","v":118}]
{"$rows_left_out":408}