{"text_format":"1","workbook":"xlsx","n_sheets":2,"sheets":["Отчет","Данные"],"not_rendered":{"charts":0,"images":1,"macros":1,"external_links":0,"defined_names":0,"comments":0,"pivot_tables":0},"unopened":[],"bounds":{"document_bytes":16777216,"sheet_cells":100000,"rows_first":2000,"rows_last":500,"rows_between":2000,"halvings":0,"cell_chars":16384,"cell_head_chars":4096},"cells_cut":0,"cells_raw":0,"read":"whole","date_system":"1900"}

{"sheet":"Отчет","index":0,"n_rows":91,"n_cols":27,"rows_kept":91,"cut":false,"hidden":false,"merged":[[7,25,10,25],[10,0,10,4],[7,24,10,24],[7,15,10,15],[7,18,10,18],[7,0,9,0],[7,23,10,23],[7,16,10,16],[0,21,0,24],[7,22,10,22],[7,20,10,20],[7,3,9,3],[7,19,10,19],[1,21,2,24],[7,17,10,17],[7,4,9,4],[36,0,38,0],[7,21,10,21],[7,5,7,7],[8,5,8,7],[8,8,8,13],[7,8,7,14],[14,0,15,0],[7,2,9,2],[7,1,9,1],[17,0,18,0],[22,0,24,0],[25,0,29,0],[30,0,32,0],[33,0,34,0],[77,0,78,0],[39,0,41,0],[42,0,45,0],[46,0,48,0],[49,0,50,0],[51,0,52,0],[56,0,58,0],[60,0,62,0],[63,0,64,0],[66,0,68,0],[70,0,71,0],[72,0,73,0]]}
["Текущий рейтинг студентов (до пересдач)",null,null,null,null,null,null,null,null,null,null,null,null,null,null,null,null,null,null,null,null,"Приложение 3"]
["Дата выгрузки: 20.01.2016",null,null,null,null,null,null,null,null,null,null,null,null,null,null,null,null,null,null,null,null,"к Положению о рейтинговой системе комплексной оценки знаний студентов "]
["Период: c 2015/2016 учебный год I семестр по 2015/2016 учебный год I семестр"]
["Факультет/отделение: Факультет коммуникаций, медиа и дизайна"]
["Направление подготовки: Журналистика"]
["Уровень образования, номер курса: Бакалавриат 1 курс",null,null,null,null,null," - студенты имеющие задолженности"]
[]
["Место","Студент","ID","Группа","Образовательная программа студента","2015/2016 учебный год 1 модуль",null,null,"2015/2016 учебный год 2 модуль",null,null,null,null,null,null,"Кредитно-рейтинговая оценка","Нормировочный коэффициент","Сумма всех кредитов ","Нормированная кредитно-рейтинговая оценка","Сумма всех оценок","Количество всех оценок","Средний балл","Минимальный балл","Наличие неудовлетворительных оценок и неявок","Количество удовлетворительных оценок","Номер места"]
[null,null,null,null,null,"Экзамен",null,null,"Экзамен",null,null,null,null,null,"Зачет"]
[null,null,null,null,null,"Безопасность жизнедеятельности","Информационные технологии подготовки печатных и электронных СМИ","Проектный семинар","Английский язык","Иностранный язык (интенсивный курс английского языка для начинающих) (1 курс)","Проектный семинар","Психология","Теория и практика русского литературного языка","Философия","Физическая культура"]
["Число текущих кредитов:",null,null,null,null,1,3,2,0,0,2,4,5,4,0]
[1,"Силкина Дарья Сергеевна",1164745493,"БЖУР151","Журналистика",10,10,10,10,null,10,9,9,10,10,201,{"$f":"IF(R12 > 0, MAX(R$12:R$91) / R12, 0)","v":1},21,{"$f":"P12*Q12","v":201},88,9,{"$f":"IF(U12 > 0,T12/U12,0)","v":9.7777777777777786},{"$f":"MIN($F12:O12)","v":9},null,9,1,"ОК"]
[2,"Первухина Алена Дмитриевна",1164745638,"БЖУР151","Журналистика",10,10,9,9,null,10,8,10,10,10,200,1,21,200,86,9,9.5555555555555554,{"$f":"MIN($F13:O13)","v":8},null,9,2,"ОК"]
[3,"Максименко Алина Алексеевна",1164743158,"БЖУР151","Журналистика",10,10,10,9,null,8,9,10,9,10,198,1,21,198,85,9,9.4444444444444446,{"$f":"MIN($F14:O14)","v":8},null,9,3,"ОК"]
["4 - 5","Матинян Алина Альбертовна",1164744056,"БЖУР152","Журналистика",10,10,10,8,null,10,8,9,10,10,197,1,21,197,85,9,9.4444444444444446,{"$f":"MIN($F15:O15)","v":8},null,9,4,"ОК"]
[null,"Мухаметов Оскар Рустямович",1164743182,"БЖУР151","Журналистика",9,10,8,9,null,8,9,10,10,10,197,1,21,197,83,9,9.2222222222222214,{"$f":"MIN($F16:O16)","v":8},null,9,5,"ОК"]
[6,"Толстикова Анна Андреевна",1164745549,"БЖУР153","Журналистика",10,10,10,10,null,10,8,10,8,10,194,1,21,194,86,9,9.5555555555555554,{"$f":"MIN($F17:O17)","v":8},null,9,6,"ОК"]
["7 - 8","Самохин Александр Юрьевич",1164743014,"БЖУР151","Журналистика",10,10,10,9,null,10,9,9,8,10,193,1,21,193,85,9,9.4444444444444446,{"$f":"MIN($F18:O18)","v":8},null,9,7,"ОК"]
[null,"Горячкина Анастасия Александровна",1164745437,"БЖУР151","Журналистика",10,10,10,9,null,8,9,9,9,10,193,1,21,193,84,9,9.3333333333333339,{"$f":"MIN($F19:O19)","v":8},null,9,8,"ОК"]
[9,"Костандова Анастасия Артуровна",1164745269,"БЖУР151","Журналистика",10,9,9,9,null,9,9,8,10,10,189,1,21,189,83,9,9.2222222222222214,{"$f":"MIN($F20:O20)","v":8},null,9,9,"ОК"]
[10,"Колодяжная Юлия Алексеевна",1164744867,"БЖУР152","Журналистика",9,10,10,9,null,10,8,9,8,10,188,1,21,188,83,9,9.2222222222222214,{"$f":"MIN($F21:O21)","v":8},null,9,10,"ОК"]
[11,"Игнатенкова Алёна Павловна",1164743402,"БЖУР152","Журналистика",9,9,8,9,null,9,9,9,9,10,187,1,21,187,81,9,9,{"$f":"MIN($F22:O22)","v":8},null,9,11,"ОК"]
["12 - 14","Покровская Вероника Андреевна",1164745577,"БЖУР153","Журналистика",10,10,8,10,null,10,8,9,8,10,185,1,21,185,83,9,9.2222222222222214,{"$f":"MIN($F23:O23)","v":8},null,9,12,"ОК"]
[null,"Федосова Анастасия Владимировна",1164745301,"БЖУР152","Журналистика",8,10,10,10,null,9,8,9,8,10,185,1,21,185,82,9,9.1111111111111107,{"$f":"MIN($F24:O24)","v":8},null,9,13,"ОК"]
[null,"Печенина Дарья Дмитриевна",1164744088,"БЖУР152","Журналистика",9,10,9,8,null,10,8,8,9,10,185,1,21,185,81,9,9,{"$f":"MIN($F25:O25)","v":8},null,9,14,"ОК"]
["15 - 19","Макагон Светлана Михайловна",1164744150,"БЖУР152","Журналистика",10,10,9,10,null,9,9,8,8,10,184,1,21,184,83,9,9.2222222222222214,{"$f":"MIN($F26:O26)","v":8},null,9,15,"ОК"]
[null,"Церцанова Ксения Витальевна",1164745141,"БЖУР152","Журналистика",10,10,9,10,null,9,9,8,8,10,184,1,21,184,83,9,9.2222222222222214,{"$f":"MIN($F27:O27)","v":8},null,9,16,"ОК"]
[null,"Коротоножкина Наталья Владимировна",1164745357,"БЖУР153","Журналистика",9,10,9,10,null,9,9,9,7,10,184,1,21,184,82,9,9.1111111111111107,{"$f":"MIN($F28:O28)","v":7},null,9,17,"ОК"]
[null,"Ардатова Екатерина Александровна",1164745698,"БЖУР152","Журналистика",8,10,9,8,null,10,8,8,9,10,184,1,21,184,80,9,8.8888888888888893,{"$f":"MIN($F29:O29)","v":8},null,9,18,"ОК"]
[null,"Щепёткина Мария Алексеевна",1164745237,"БЖУР152","Журналистика",9,10,8,9,null,8,9,9,8,10,184,1,21,184,80,9,8.8888888888888893,{"$f":"MIN($F30:O30)","v":8},null,9,19,"ОК"]
["20 - 22","Тумбаева Ирина Игоревна",1164745606,"БЖУР152","Журналистика",10,9,10,9,null,9,9,8,8,10,183,1,21,183,82,9,9.1111111111111107,{"$f":"MIN($F31:O31)","v":8},null,9,20,"ОК"]
[null,"Баталова Екатерина Александровна",1164744118,"БЖУР152","Журналистика",9,10,9,9,null,9,8,8,9,10,183,1,21,183,81,9,9,{"$f":"MIN($F32:O32)","v":8},null,9,21,"ОК"]
[null,"Попова Дарья Александровна",1164743062,"БЖУР152","Журналистика",9,10,9,8,null,9,8,8,9,10,183,1,21,183,80,9,8.8888888888888893,{"$f":"MIN($F33:O33)","v":8},null,9,22,"ОК"]
["23 - 24","Ревва Наталья Павловна",1164745726,"БЖУР152","Журналистика",9,10,8,9,null,9,8,9,8,10,182,1,21,182,80,9,8.8888888888888893,{"$f":"MIN($F34:O34)","v":8},null,9,23,"ОК"]
[null,"Фархутдинова Алина Илдаровна",1164743038,"БЖУР151","Журналистика",8,9,10,8,null,9,8,9,8,10,182,1,21,182,79,9,8.7777777777777786,{"$f":"MIN($F35:O35)","v":8},null,9,24,"ОК"]
[25,"Усталова Валерия Михайловна",1164745413,"БЖУР153","Журналистика",9,10,9,9,null,10,8,8,8,10,181,1,21,181,81,9,9,{"$f":"MIN($F36:O36)","v":8},null,9,25,"ОК"]
["26 - 28","Жаринова Анна Александровна",1164745670,"БЖУР152","Журналистика",8,10,10,9,null,9,8,8,8,10,180,1,21,180,80,9,8.8888888888888893,{"$f":"MIN($F37:O37)","v":8},null,9,26,"ОК"]
[null,"Суховеева Александра Сергеевна",1164744895,"БЖУР152","Журналистика",9,10,8,9,null,8,8,9,8,10,180,1,21,180,79,9,8.7777777777777786,{"$f":"MIN($F38:O38)","v":8},null,9,27,"ОК"]
[null,"Ящанина Кристина Тадеушевна",1164743712,"БЖУР151","Журналистика",9,10,10,8,null,8,8,9,7,10,180,1,21,180,79,9,8.7777777777777786,{"$f":"MIN($F39:O39)","v":7},null,9,28,"ОК"]
["29 - 31","Грищенко Татьяна Сергеевна",1164745461,"БЖУР152","Журналистика",9,10,9,10,null,9,8,8,8,10,179,1,21,179,81,9,9,{"$f":"MIN($F40:O40)","v":8},null,9,29,"ОК"]
{"$rows_left_out":52}
{"sheet":"Данные","index":1,"n_rows":718,"n_cols":23,"rows_kept":718,"cut":false,"hidden":true,"merged":[]}
["ID","Оценка из 10 баллов до пересдач","Группа","Студент","Фамилия","Имя","Отчество","Номер студенческого билета","Строка учебного плана","Текущих кредитов за испытание","Вид испытания","Календарный период по плану","Неявка до пересдач","В текущий рейтинг","Текущих кредитов для студента","Оценка зачет/незачет до пересдач","Является бюджетным","Учебный план","Вид записи РУП","Вид записи ИУП","Номер Row"]
[1,2,3,4,5,6,7,8,9,10,11,12,13,14,15,16,17,18,19,20,21]
[1190301050,8,"БЖУР152",1164745698,"Ардатова","Екатерина","Александровна","М151БЖУРН002","Безопасность жизнедеятельности",1,"Экзамен","2015/2016 учебный год 1 модуль",null,8,1,1,1,1014950343,2098,null,"stCommon","Журналистика",{"$f":"MATCH(D3,Отчет!$C:$C,0)","v":29}]
[1190302214,9,"БЖУР152",1164745726,"Ревва","Наталья","Павловна","М151БЖУРН042","Безопасность жизнедеятельности",1,"Экзамен","2015/2016 учебный год 1 модуль",null,9,1,1,1,1014950343,2098,null,"stCommon","Журналистика",{"$f":"MATCH(D4,Отчет!$C:$C,0)","v":34}]
[1190300836,8,"БЖУР151",1164745754,"Шаблинская","Анастасия","Ильинична","М151БЖУРН062","Безопасность жизнедеятельности",1,"Экзамен","2015/2016 учебный год 1 модуль",null,8,1,1,1,1014950343,2098,null,"stCommon","Журналистика",{"$f":"MATCH(D5,Отчет!$C:$C,0)","v":44}]
[1190302992,9,"БЖУР153",1164745778,"Дмитриева","Елена","Владимировна","М151БЖУРН011","Безопасность жизнедеятельности",1,"Экзамен","2015/2016 учебный год 1 модуль",null,9,1,1,1,1014950343,2098,null,"stCommon","Журналистика",{"$f":"MATCH(D6,Отчет!$C:$C,0)","v":75}]
[1190301242,8,"БЖУР152",1173929254,"Вербицкий","Даниил","Андреевич","М151БЖУРН077","Безопасность жизнедеятельности",1,"Экзамен","2015/2016 учебный год 1 модуль",null,8,1,1,0,1014950343,2098,null,"stCommon","Журналистика",{"$f":"MATCH(D7,Отчет!$C:$C,0)","v":64}]
[1190300369,5,null,1173929278,"Радостева","Дарья","Андреевна","М151БЖУРН076","Безопасность жизнедеятельности",1,"Экзамен","2015/2016 учебный год 1 модуль",null,5,1,1,0,1014950343,2098,null,"stCommon","Журналистика",{"$f":"MATCH(D8,Отчет!$C:$C,0)","v":91}]
[1190300131,9,"БЖУР151",1181071063,"Попова","Дарья","Ильинична","М151БЖУРН075","Безопасность жизнедеятельности",1,"Экзамен","2015/2016 учебный год 1 модуль",null,9,1,1,1,1014950343,2098,null,"stCommon","Журналистика",{"$f":"MATCH(D9,Отчет!$C:$C,0)","v":50}]
[1190303120,9,"БЖУР153",1181071087,"Иванова","Надежда","-","М151БЖУРН071","Безопасность жизнедеятельности",1,"Экзамен","2015/2016 учебный год 1 модуль",null,9,1,1,1,1014950343,2098,null,"stCommon","Журналистика",{"$f":"MATCH(D10,Отчет!$C:$C,0)","v":82}]
[1190301178,7,"БЖУР152",1181071111,"Батыршина","Сабина","Рустамовна","М151БЖУРН073","Безопасность жизнедеятельности",1,"Экзамен","2015/2016 учебный год 1 модуль",null,7,1,1,1,1014950343,2098,null,"stCommon","Журналистика",{"$f":"MATCH(D11,Отчет!$C:$C,0)","v":86}]
[1190301498,9,"БЖУР152",1181072218,"Казакова","Анастасия","Сергеевна","М151БЖУРН074","Безопасность жизнедеятельности",1,"Экзамен","2015/2016 учебный год 1 модуль",null,9,1,1,1,1014950343,2098,null,"stCommon","Журналистика",{"$f":"MATCH(D12,Отчет!$C:$C,0)","v":61}]
[1190304211,8,"БЖУР153",1181072242,"Шарафутдинова","Алина","Эриковна","М151БЖУРН072","Безопасность жизнедеятельности",1,"Экзамен","2015/2016 учебный год 1 модуль",null,8,1,1,1,1014950343,2098,null,"stCommon","Журналистика",{"$f":"MATCH(D13,Отчет!$C:$C,0)","v":79}]
[1190299705,9,"БЖУР151",1187795456,"Минина","Алена","Дмитриевна","М151БЖУРН069","Безопасность жизнедеятельности",1,"Экзамен","2015/2016 учебный год 1 модуль",null,9,1,1,0,1014950343,2098,null,"stCommon","Журналистика",{"$f":"MATCH(D14,Отчет!$C:$C,0)","v":80}]
[1190302076,9,"БЖУР152",1187795484,"Покровская","Наталия","Юрьевна","М151БЖУРН070","Безопасность жизнедеятельности",1,"Экзамен","2015/2016 учебный год 1 модуль",null,9,1,1,0,1014950343,2098,null,"stCommon","Журналистика",{"$f":"MATCH(D15,Отчет!$C:$C,0)","v":88}]
[1190302864,8,"БЖУР153",1187952687,"Вечер","Екатерина","Максимовна","М151БЖУРН078","Безопасность жизнедеятельности",1,"Экзамен","2015/2016 учебный год 1 модуль",null,8,1,1,0,1014950343,2098,null,"stCommon","Журналистика",{"$f":"MATCH(D16,Отчет!$C:$C,0)","v":87}]
[1256502614,8,"БЖУР151",1254163379,"Лысакова","Алина","Сергеевна","М151БЖУРН079","Безопасность жизнедеятельности",1,"Экзамен","2015/2016 учебный год 1 модуль",null,8,1,1,0,1014950343,2098,"ikPlanned","stCommon","Журналистика",{"$f":"MATCH(D17,Отчет!$C:$C,0)","v":60}]
[1358969857,8,"БЖУР152",1358951391,"Коряшкин","Олег","Георгиевич","116-24/13-278","Безопасность жизнедеятельности",1,"Экзамен","2015/2016 учебный год 1 модуль",null,8,1,1,0,1014950343,2098,"ikPassed","stCommon","Журналистика",{"$f":"MATCH(D18,Отчет!$C:$C,0)","v":65}]
[1190301626,10,"БЖУР152",1164744927,"Красовская","Дарья","Михайловна","М151БЖУРН022","Безопасность жизнедеятельности",1,"Экзамен","2015/2016 учебный год 1 модуль",null,10,1,1,1,1014950343,2098,null,"stCommon","Журналистика",{"$f":"MATCH(D19,Отчет!$C:$C,0)","v":47}]
[1190302736,7,"БЖУР153",1164744959,"Арутюнян","Нора","Левоновна","М151БЖУРН003","Безопасность жизнедеятельности",1,"Экзамен","2015/2016 учебный год 1 модуль",null,7,1,1,1,1014950343,2098,null,"stCommon","Журналистика",{"$f":"MATCH(D20,Отчет!$C:$C,0)","v":72}]
[1190302544,10,"БЖУР152",1164745141,"Церцанова","Ксения","Витальевна","М151БЖУРН060","Безопасность жизнедеятельности",1,"Экзамен","2015/2016 учебный год 1 модуль",null,10,1,1,1,1014950343,2098,null,"stCommon","Журналистика",{"$f":"MATCH(D21,Отчет!$C:$C,0)","v":27}]
[1190302278,10,"БЖУР152",1164745173,"Симонова","Татьяна","Андреевна","М151БЖУРН048","Безопасность жизнедеятельности",1,"Экзамен","2015/2016 учебный год 1 модуль",null,10,1,1,1,1014950343,2098,null,"stCommon","Журналистика",{"$f":"MATCH(D22,Отчет!$C:$C,0)","v":48}]
[1190299565,9,"БЖУР151",1164745205,"Матвеева","Екатерина","Вячеславовна","М151БЖУРН030","Безопасность жизнедеятельности",1,"Экзамен","2015/2016 учебный год 1 модуль",null,9,1,1,1,1014950343,2098,null,"stCommon","Журналистика",{"$f":"MATCH(D23,Отчет!$C:$C,0)","v":55}]
[1190302672,9,"БЖУР152",1164745237,"Щепёткина","Мария","Алексеевна","М151БЖУРН066","Безопасность жизнедеятельности",1,"Экзамен","2015/2016 учебный год 1 модуль",null,9,1,1,1,1014950343,2098,null,"stCommon","Журналистика",{"$f":"MATCH(D24,Отчет!$C:$C,0)","v":30}]
[1190299185,10,"БЖУР151",1164745269,"Костандова","Анастасия","Артуровна","М151БЖУРН021","Безопасность жизнедеятельности",1,"Экзамен","2015/2016 учебный год 1 модуль",null,10,1,1,1,1014950343,2098,null,"stCommon","Журналистика",{"$f":"MATCH(D25,Отчет!$C:$C,0)","v":20}]
[1190302480,8,"БЖУР152",1164745301,"Федосова","Анастасия","Владимировна","М151БЖУРН057","Безопасность жизнедеятельности",1,"Экзамен","2015/2016 учебный год 1 модуль",null,8,1,1,1,1014950343,2098,null,"stCommon","Журналистика",{"$f":"MATCH(D26,Отчет!$C:$C,0)","v":24}]
[1190300271,9,"БЖУР151",1164745329,"Попова","Валерия","Андреевна","М151БЖУРН041","Безопасность жизнедеятельности",1,"Экзамен","2015/2016 учебный год 1 модуль",null,9,1,1,1,1014950343,2098,null,"stCommon","Журналистика",{"$f":"MATCH(D27,Отчет!$C:$C,0)","v":58}]
[1190303248,9,"БЖУР153",1164745357,"Коротоножкина","Наталья","Владимировна","М151БЖУРН020","Безопасность жизнедеятельности",1,"Экзамен","2015/2016 учебный год 1 модуль",null,9,1,1,1,1014950343,2098,null,"stCommon","Журналистика",{"$f":"MATCH(D28,Отчет!$C:$C,0)","v":28}]
[1190304345,9,"БЖУР153",1164745381,"Юдакова","Дарья","Сергеевна","М151БЖУРН067","Безопасность жизнедеятельности",1,"Экзамен","2015/2016 учебный год 1 модуль",null,9,1,1,1,1014950343,2098,null,"stCommon","Журналистика",{"$f":"MATCH(D29,Отчет!$C:$C,0)","v":49}]
[1190304017,9,"БЖУР153",1164745413,"Усталова","Валерия","Михайловна","М151БЖУРН055","Безопасность жизнедеятельности",1,"Экзамен","2015/2016 учебный год 1 модуль",null,9,1,1,1,1014950343,2098,null,"stCommon","Журналистика",{"$f":"MATCH(D30,Отчет!$C:$C,0)","v":36}]
[1190296874,10,"БЖУР151",1164745437,"Горячкина","Анастасия","Александровна","М151БЖУРН009","Безопасность жизнедеятельности",1,"Экзамен","2015/2016 учебный год 1 модуль",null,10,1,1,1,1014950343,2098,null,"stCommon","Журналистика",{"$f":"MATCH(D31,Отчет!$C:$C,0)","v":19}]
[1190301306,9,"БЖУР152",1164745461,"Грищенко","Татьяна","Сергеевна","М151БЖУРН010","Безопасность жизнедеятельности",1,"Экзамен","2015/2016 учебный год 1 модуль",null,9,1,1,1,1014950343,2098,null,"stCommon","Журналистика",{"$f":"MATCH(D32,Отчет!$C:$C,0)","v":40}]
[1190300561,10,"БЖУР151",1164745493,"Силкина","Дарья","Сергеевна","М151БЖУРН047","Безопасность жизнедеятельности",1,"Экзамен","2015/2016 учебный год 1 модуль",null,10,1,1,1,1014950343,2098,null,"stCommon","Журналистика",{"$f":"MATCH(D33,Отчет!$C:$C,0)","v":12}]
[1190304081,7,"БЖУР153",1164745525,"Хайретдинова","Алиса","Рустемовна","М151БЖУРН058","Безопасность жизнедеятельности",1,"Экзамен","2015/2016 учебный год 1 модуль",null,7,1,1,1,1014950343,2098,null,"stCommon","Журналистика",{"$f":"MATCH(D34,Отчет!$C:$C,0)","v":54}]
[1190303888,10,"БЖУР153",1164745549,"Толстикова","Анна","Андреевна","М151БЖУРН052","Безопасность жизнедеятельности",1,"Экзамен","2015/2016 учебный год 1 модуль",null,10,1,1,1,1014950343,2098,null,"stCommon","Журналистика",{"$f":"MATCH(D35,Отчет!$C:$C,0)","v":17}]
[1190303568,10,"БЖУР153",1164745577,"Покровская","Вероника","Андреевна","М151БЖУРН038","Безопасность жизнедеятельности",1,"Экзамен","2015/2016 учебный год 1 модуль",null,10,1,1,1,1014950343,2098,null,"stCommon","Журналистика",{"$f":"MATCH(D36,Отчет!$C:$C,0)","v":23}]
[1190302416,10,"БЖУР152",1164745606,"Тумбаева","Ирина","Игоревна","М151БЖУРН054","Безопасность жизнедеятельности",1,"Экзамен","2015/2016 учебный год 1 модуль",null,10,1,1,1,1014950343,2098,null,"stCommon","Журналистика",{"$f":"MATCH(D37,Отчет!$C:$C,0)","v":31}]
[1190299987,10,"БЖУР151",1164745638,"Первухина","Алена","Дмитриевна","М151БЖУРН036","Безопасность жизнедеятельности",1,"Экзамен","2015/2016 учебный год 1 модуль",null,10,1,1,1,1014950343,2098,null,"stCommon","Журналистика",{"$f":"MATCH(D38,Отчет!$C:$C,0)","v":13}]
[1190301370,8,"БЖУР152",1164745670,"Жаринова","Анна","Александровна","М151БЖУРН013","Безопасность жизнедеятельности",1,"Экзамен","2015/2016 учебный год 1 модуль",null,8,1,1,1,1014950343,2098,null,"stCommon","Журналистика",{"$f":"MATCH(D39,Отчет!$C:$C,0)","v":37}]
[1190300965,9,"БЖУР151",1164743712,"Ящанина","Кристина","Тадеушевна","М151БЖУРН068","Безопасность жизнедеятельности",1,"Экзамен","2015/2016 учебный год 1 модуль",null,9,1,1,0,1014950343,2098,null,"stCommon","Журналистика",{"$f":"MATCH(D40,Отчет!$C:$C,0)","v":39}]
{"$rows_left_out":678}