{"text_format":"1","workbook":"xlsx","n_sheets":2,"sheets":["Отчет","Данные"],"not_rendered":{"charts":0,"images":1,"macros":1,"external_links":0,"defined_names":0,"comments":0,"pivot_tables":0},"unopened":[],"bounds":{"document_bytes":16777216,"sheet_cells":100000,"rows_first":2000,"rows_last":500,"rows_between":2000,"halvings":0,"cell_chars":16384,"cell_head_chars":4096},"cells_cut":0,"cells_raw":0,"read":"whole","date_system":"1900"}

{"sheet":"Отчет","index":0,"n_rows":128,"n_cols":37,"rows_kept":128,"cut":false,"hidden":false,"merged":[[7,35,10,35],[10,0,10,4],[7,34,10,34],[7,25,10,25],[7,28,10,28],[7,0,9,0],[7,33,10,33],[7,26,10,26],[0,31,0,34],[7,32,10,32],[7,30,10,30],[7,3,9,3],[7,29,10,29],[1,31,2,34],[7,27,10,27],[7,4,9,4],[32,0,44,0],[7,31,10,31],[8,6,8,7],[7,6,7,9],[8,8,8,9],[8,10,8,21],[7,10,7,24],[8,22,8,24],[7,2,9,2],[7,1,9,1],[13,0,18,0],[19,0,21,0],[22,0,23,0],[24,0,28,0],[29,0,31,0],[94,0,95,0],[46,0,47,0],[48,0,51,0],[52,0,54,0],[55,0,61,0],[63,0,65,0],[66,0,70,0],[72,0,73,0],[74,0,79,0],[80,0,81,0],[82,0,85,0],[86,0,92,0],[119,0,120,0],[125,0,126,0],[96,0,97,0],[98,0,102,0],[104,0,108,0],[109,0,110,0],[111,0,113,0],[116,0,117,0]]}
["Текущий рейтинг студентов (до пересдач)",null,null,null,null,null,null,null,null,null,null,null,null,null,null,null,null,null,null,null,null,null,null,null,null,null,null,null,null,null,null,"Приложение 3"]
["Дата выгрузки: 20.01.2016",null,null,null,null,null,null,null,null,null,null,null,null,null,null,null,null,null,null,null,null,null,null,null,null,null,null,null,null,null,null,"к Положению о рейтинговой системе комплексной оценки знаний студентов "]
["Период: c 2015/2016 учебный год I семестр по 2015/2016 учебный год I семестр"]
["Факультет/отделение: Факультет коммуникаций, медиа и дизайна"]
["Направление подготовки: Медиакоммуникации"]
["Уровень образования, номер курса: Бакалавриат 1 курс",null,null,null,null,null,null," - студенты имеющие задолженности"]
[]
["Место","Студент","ID","Группа","Образовательная программа студента",null,"2015/2016 учебный год 1 модуль",null,null,null,"2015/2016 учебный год 2 модуль",null,null,null,null,null,null,null,null,null,null,null,null,null,null,"Кредитно-рейтинговая оценка","Нормировочный коэффициент","Сумма всех кредитов ","Нормированная кредитно-рейтинговая оценка","Сумма всех оценок","Количество всех оценок","Средний балл","Минимальный балл","Наличие неудовлетворительных оценок и неявок","Количество удовлетворительных оценок","Номер места"]
[null,null,null,null,null,null,"Экзамен",null,"Зачет",null,"Экзамен",null,null,null,null,null,null,null,null,null,null,null,"Зачет"]
[null,null,null,null,null,"Номер Row","Безопасность жизнедеятельности","Мода, костюм, личность: человек и его одежда в общественном пространстве","Безопасность жизнедеятельности","Безопасность жизнедеятельности","Английский язык","Иностранный язык (интенсивный курс английского языка для начинающих) (1 курс)","История","История западноевропейской музыки: от Баха до Шёнберга. Опыт философского анализа и рационального восприятия","Курс маркетинговых исследований ГфК","Парапсихологическая феноменология: психологический анализ","Проектный семинар","Проектный семинар","Социология","Танец и двигательная культура в истории и современности","Теория и практика русского литературного языка","Христианство, ислам, иудаизм в истории Европы: конфликты и диалог, XI-XIX вв","История","Теория и практика русского литературного языка","Физическая культура"]
["Число текущих кредитов:",null,null,null,null,null,1,0,1,3,0,0,4,0,0,0,3,4,4,0,4,0,4,4,0]
[1,"Теплякова Мария Дмитриевна",1162394212,"БМД154","Медиакоммуникации",{"$f":"MATCH(C12,Данные!$D:$D,0)","v":77},9,null,null,null,10,null,10,null,null,null,null,9,10,null,10,null,null,null,10,165,{"$f":"IF(AB12 > 0, MAX(AB$12:AB$128) / AB12, 0)","v":1.0588235294117647},17,{"$f":"Z12*AA12","v":174.70588235294119},68,7,{"$f":"IF(AE12 > 0,AD12/AE12,0)","v":9.7142857142857135},{"$f":"MIN($G12:Y12)","v":9},null,7,1,"ОК"]
[2,"Кавалерян Артем Каренович",1162394371,"БМД154","Медиакоммуникации",{"$f":"MATCH(C13,Данные!$D:$D,0)","v":82},8,null,null,null,10,null,10,null,null,null,null,9,10,null,10,null,null,null,10,164,1.0588235294117647,17,173.64705882352942,67,7,9.5714285714285712,{"$f":"MIN($G13:Y13)","v":8},null,7,2,"ОК"]
["3 - 8","Пенкова Миглена Мирославовна",1162394053,"БМД151","Медиакоммуникации",{"$f":"MATCH(C14,Данные!$D:$D,0)","v":75},10,null,null,null,9,null,9,null,null,null,null,9,10,null,10,null,null,null,10,162,1.0588235294117647,17,171.52941176470588,67,7,9.5714285714285712,{"$f":"MIN($G14:Y14)","v":9},null,7,3,"ОК"]
[null,"Топонен Анастасия Андреевна",1162394245,"БМД151","Медиакоммуникации",{"$f":"MATCH(C15,Данные!$D:$D,0)","v":78},10,null,null,null,9,null,9,null,null,null,null,9,10,null,10,null,null,null,10,162,1.0588235294117647,17,171.52941176470588,67,7,9.5714285714285712,{"$f":"MIN($G15:Y15)","v":9},null,7,4,"ОК"]
[null,"Янулова Полина Петровна",1162394188,"БМД153","Медиакоммуникации",{"$f":"MATCH(C16,Данные!$D:$D,0)","v":43},10,null,null,null,9,null,9,null,null,null,null,9,10,null,10,null,null,null,10,162,1.0588235294117647,17,171.52941176470588,67,7,9.5714285714285712,{"$f":"MIN($G16:Y16)","v":9},null,7,5,"ОК"]
[null,"Федорова Екатерина Денисовна",1162390230,"БМД154","Медиакоммуникации",{"$f":"MATCH(C17,Данные!$D:$D,0)","v":45},10,null,null,null,8,null,9,null,null,null,null,9,10,null,10,null,null,null,10,162,1.0588235294117647,17,171.52941176470588,66,7,9.4285714285714288,{"$f":"MIN($G17:Y17)","v":8},null,7,6,"ОК"]
[null,"Самарчева Диана Сергеевна",1162394020,"БМД151","Медиакоммуникации",{"$f":"MATCH(C18,Данные!$D:$D,0)","v":74},10,null,null,null,8,null,10,null,null,9,null,9,10,null,9,null,null,null,10,162,1.0588235294117647,17,171.52941176470588,75,8,9.375,{"$f":"MIN($G18:Y18)","v":8},null,8,7,"ОК"]
[null,"Рудакова Дарья Александровна",1162394889,"БМД152","Медиакоммуникации",{"$f":"MATCH(C19,Данные!$D:$D,0)","v":91},10,null,null,null,7,null,9,null,null,null,null,9,10,null,10,null,null,null,10,162,1.0588235294117647,17,171.52941176470588,65,7,9.2857142857142865,{"$f":"MIN($G19:Y19)","v":7},null,7,8,"ОК"]
["9 - 11","Дроздова Валентина Евгеньевна",1162394825,"БМД152","Медиакоммуникации",{"$f":"MATCH(C20,Данные!$D:$D,0)","v":89},9,null,null,null,9,null,10,null,null,null,null,9,9,null,10,null,null,null,10,161,1.0588235294117647,17,170.47058823529412,66,7,9.4285714285714288,{"$f":"MIN($G20:Y20)","v":9},null,7,9,"ОК"]
[null,"Константиниди Мария Константиновна",1162394310,"БМД154","Медиакоммуникации",{"$f":"MATCH(C21,Данные!$D:$D,0)","v":80},9,null,null,null,9,null,9,null,null,null,null,9,10,null,10,null,null,null,10,161,1.0588235294117647,17,170.47058823529412,66,7,9.4285714285714288,{"$f":"MIN($G21:Y21)","v":9},null,7,10,"ОК"]
[null,"Феер Наталья Ивановна",1162394673,"БМД153","Медиакоммуникации",{"$f":"MATCH(C22,Данные!$D:$D,0)","v":32},9,null,null,null,9,null,9,null,null,null,null,9,10,null,10,null,null,null,10,161,1.0588235294117647,17,170.47058823529412,66,7,9.4285714285714288,{"$f":"MIN($G22:Y22)","v":9},null,7,11,"ОК"]
["12 - 13","Прудникова Кристина Юрьевна",1162390763,"БМД151","Медиакоммуникации",{"$f":"MATCH(C23,Данные!$D:$D,0)","v":112},10,null,null,null,8,null,8,null,null,null,null,9,10,null,10,null,null,null,10,158,1.0588235294117647,17,167.29411764705881,65,7,9.2857142857142865,{"$f":"MIN($G23:Y23)","v":8},null,7,12,"ОК"]
[null,"Андриасян Лилит Грачьяевна",1187793154,"БМД153","Медиакоммуникации",{"$f":"MATCH(C24,Данные!$D:$D,0)","v":46},10,null,null,null,7,null,9,null,null,null,null,9,10,null,9,null,null,null,10,158,1.0588235294117647,17,167.29411764705881,64,7,9.1428571428571423,{"$f":"MIN($G24:Y24)","v":7},null,7,13,"ОК"]
["14 - 18","Гребнева Мария",1181089083,"БМД154","Медиакоммуникации",{"$f":"MATCH(C25,Данные!$D:$D,0)","v":26},9,null,null,null,9,null,9,null,null,null,null,9,10,null,9,null,null,null,10,157,1.0588235294117647,17,166.23529411764707,65,7,9.2857142857142865,{"$f":"MIN($G25:Y25)","v":9},null,7,14,"ОК"]
[null,"Душутина Анастасия Алексеевна",1162394342,"БМД154","Медиакоммуникации",{"$f":"MATCH(C26,Данные!$D:$D,0)","v":81},9,null,null,null,9,null,9,null,null,null,null,9,9,null,10,null,null,null,10,157,1.0588235294117647,17,166.23529411764707,65,7,9.2857142857142865,{"$f":"MIN($G26:Y26)","v":9},null,7,15,"ОК"]
[null,"Иванов Александр Михайлович",1162394953,"БМД151","Медиакоммуникации",{"$f":"MATCH(C27,Данные!$D:$D,0)","v":93},9,null,null,null,9,null,10,null,null,null,null,9,10,null,8,null,null,null,10,157,1.0588235294117647,17,166.23529411764707,65,7,9.2857142857142865,{"$f":"MIN($G27:Y27)","v":8},null,7,16,"ОК"]
[null,"Геренюк Инесса Вадимовна",1181089100,"БМД152","Медиакоммуникации",{"$f":"MATCH(C28,Данные!$D:$D,0)","v":28},9,"нет оценки",null,null,8,null,9,null,null,null,null,9,10,null,9,null,null,null,10,157,1.0588235294117647,17,166.23529411764707,64,7,9.1428571428571423,{"$f":"MIN($G28:Y28)","v":8},null,7,17,"ОК"]
[null,"Карзанова Елена Станиславовна",1162392583,"БМД151","Медиакоммуникации",{"$f":"MATCH(C29,Данные!$D:$D,0)","v":31},9,null,null,null,8,null,9,null,null,null,null,9,10,null,9,null,null,null,10,157,1.0588235294117647,17,166.23529411764707,64,7,9.1428571428571423,{"$f":"MIN($G29:Y29)","v":8},null,7,18,"ОК"]
["19 - 21","Хохлова Арина Валерьевна",1162394531,"БМД154","Медиакоммуникации",{"$f":"MATCH(C30,Данные!$D:$D,0)","v":85},10,null,null,null,10,null,9,null,null,null,null,8,9,null,10,null,null,null,10,154,1.0588235294117647,17,163.05882352941177,66,7,9.4285714285714288,{"$f":"MIN($G30:Y30)","v":8},null,7,19,"ОК"]
[null,"Газизянова Алия Булатовна",1162392334,"БМД152","Медиакоммуникации",{"$f":"MATCH(C31,Данные!$D:$D,0)","v":61},10,null,null,null,9,null,9,null,null,null,null,9,9,null,9,null,null,null,10,154,1.0588235294117647,17,163.05882352941177,65,7,9.2857142857142865,{"$f":"MIN($G31:Y31)","v":9},null,7,20,"ОК"]
[null,"Русскова Мария Олеговна",1162391718,"БМД153","Медиакоммуникации",{"$f":"MATCH(C32,Данные!$D:$D,0)","v":16},10,null,null,null,7,null,9,null,null,null,null,9,9,null,9,null,null,null,10,154,1.0588235294117647,17,163.05882352941177,63,7,9,{"$f":"MIN($G32:Y32)","v":7},null,7,21,"ОК"]
["22 - 34","Джаямаха Бинари Николь",1162390547,"БМД154","Медиакоммуникации",{"$f":"MATCH(C33,Данные!$D:$D,0)","v":108},9,null,null,null,9,null,8,null,null,null,null,9,9,null,10,null,null,null,10,153,1.0588235294117647,17,162,64,7,9.1428571428571423,{"$f":"MIN($G33:Y33)","v":8},null,7,22,"ОК"]
[null,"Борисова Анна Александровна",1162392719,"БМД154","Медиакоммуникации",{"$f":"MATCH(C34,Данные!$D:$D,0)","v":69},9,null,null,null,null,8,8,null,null,null,null,10,8,null,10,null,null,null,10,153,1.0588235294117647,17,162,63,7,9,{"$f":"MIN($G34:Y34)","v":8},null,7,23,"ОК"]
[null,"Лузай Анна Александровна",1162392861,"БМД153","Медиакоммуникации",{"$f":"MATCH(C35,Данные!$D:$D,0)","v":73},9,null,null,null,8,null,8,null,null,null,null,9,10,null,9,null,null,null,10,153,1.0588235294117647,17,162,63,7,9,{"$f":"MIN($G35:Y35)","v":8},null,7,24,"ОК"]
[null,"Панченко Дарья Николаевна",1162392146,"БМД151","Медиакоммуникации",{"$f":"MATCH(C36,Данные!$D:$D,0)","v":56},9,null,null,null,8,null,8,null,null,null,null,9,10,null,9,null,null,null,10,153,1.0588235294117647,17,162,63,7,9,{"$f":"MIN($G36:Y36)","v":8},null,7,25,"ОК"]
[null,"Чернышкова Софья Михайловна",1162391309,"БМД151","Медиакоммуникации",{"$f":"MATCH(C37,Данные!$D:$D,0)","v":5},9,null,null,null,8,null,9,null,null,null,null,9,10,null,8,null,null,null,10,153,1.0588235294117647,17,162,63,7,9,{"$f":"MIN($G37:Y37)","v":8},null,7,26,"ОК"]
[null,"Чубукин Георгий Викторович",1162390146,"БМД152","Медиакоммуникации",{"$f":"MATCH(C38,Данные!$D:$D,0)","v":101},9,null,null,null,8,null,9,null,null,null,null,9,8,null,10,null,null,null,10,153,1.0588235294117647,17,162,63,7,9,{"$f":"MIN($G38:Y38)","v":8},null,7,27,"ОК"]
[null,"Ярина Анна Андреевна",1162392184,"БМД153","Медиакоммуникации",{"$f":"MATCH(C39,Данные!$D:$D,0)","v":57},9,null,null,null,8,null,9,null,null,null,null,9,10,null,8,null,null,null,10,153,1.0588235294117647,17,162,63,7,9,{"$f":"MIN($G39:Y39)","v":8},null,7,28,"ОК"]
[null,"Архипова Анна Александровна",1162391207,"БМД153","Медиакоммуникации",{"$f":"MATCH(C40,Данные!$D:$D,0)","v":3},9,null,null,null,7,null,8,null,null,"н/я",null,9,9,null,10,null,null,null,10,153,1.0588235294117647,17,162,62,7,8.8571428571428577,{"$f":"MIN($G40:Y40)","v":7},null,7,29,"ОК"]
{"$rows_left_out":89}
{"sheet":"Данные","index":1,"n_rows":832,"n_cols":23,"rows_kept":832,"cut":false,"hidden":true,"merged":[]}
["ID","Оценка из 10 баллов до пересдач","Группа","Студент","Фамилия","Имя","Отчество","Номер студенческого билета","Строка учебного плана","Текущих кредитов за испытание","Вид испытания","Календарный период по плану","Неявка до пересдач","В текущий рейтинг","Текущих кредитов для студента","Оценка зачет/незачет до пересдач","Является бюджетным","Учебный план","Вид записи РУП","Вид записи ИУП","Номер Row"]
[1,2,3,4,5,6,7,8,9,10,11,12,13,14,15,16,17,18,19,20,21]
[1178842986,9,"БМД153",1162391207,"Архипова","Анна","Александровна","М151БМКМК002","Безопасность жизнедеятельности",1,"Экзамен","2015/2016 учебный год 1 модуль",null,9,1,1,0,1017338279,2098,null,"stCommon","Медиакоммуникации",{"$f":"MATCH(D3,Отчет!$C:$C,0)","v":40}]
[1190307356,10,"БМД153",1162391241,"Бельцов","Даниил","Олегович","М151БМКМК007","Безопасность жизнедеятельности",1,"Экзамен","2015/2016 учебный год 1 модуль",null,10,1,1,0,1017338279,2098,null,"stCommon","Медиакоммуникации",{"$f":"MATCH(D4,Отчет!$C:$C,0)","v":66}]
[1190314556,9,"БМД151",1162391309,"Чернышкова","Софья","Михайловна","М151БМКМК097","Безопасность жизнедеятельности",1,"Экзамен","2015/2016 учебный год 1 модуль",null,9,1,1,0,1017338279,2098,null,"stCommon","Медиакоммуникации",{"$f":"MATCH(D5,Отчет!$C:$C,0)","v":37}]
[1190315450,10,"БМД152",1162391341,"Дашкова","Валерия","Максимовна","М151БМКМК022","Безопасность жизнедеятельности",1,"Экзамен","2015/2016 учебный год 1 модуль",null,10,1,1,0,1017338279,2098,null,"stCommon","Медиакоммуникации",{"$f":"MATCH(D6,Отчет!$C:$C,0)","v":74}]
[1190308678,8,"БМД153",1162391369,"Филимонова","Ксения","Игоревна","М151БМКМК095","Безопасность жизнедеятельности",1,"Экзамен","2015/2016 учебный год 1 модуль",null,8,1,1,0,1017338279,2098,null,"stCommon","Медиакоммуникации",{"$f":"MATCH(D7,Отчет!$C:$C,0)","v":110}]
[1178843101,8,"БМД151",1162391446,"Болгова","Дарья","Кирилловна","М151БМКМК009","Безопасность жизнедеятельности",1,"Экзамен","2015/2016 учебный год 1 модуль",null,8,1,1,0,1017338279,2098,null,"stCommon","Медиакоммуникации",{"$f":"MATCH(D8,Отчет!$C:$C,0)","v":101}]
[1190308230,10,"БМД153",1162391480,"Обжерина","Валерия","Владимировна","М151БМКМК063","Безопасность жизнедеятельности",1,"Экзамен","2015/2016 учебный год 1 модуль",null,10,1,1,0,1017338279,2098,null,"stCommon","Медиакоммуникации",{"$f":"MATCH(D9,Отчет!$C:$C,0)","v":96}]
[1190315100,10,"БМД152",1162391514,"Бударова","Дарья","Дмитриевна","М151БМКМК012","Безопасность жизнедеятельности",1,"Экзамен","2015/2016 учебный год 1 модуль",null,10,1,1,0,1017338279,2098,null,"stCommon","Медиакоммуникации",{"$f":"MATCH(D10,Отчет!$C:$C,0)","v":54}]
[1190316319,9,"БМД152",1162391546,"Самсонкина","Мария","Александровна","М151БМКМК078","Безопасность жизнедеятельности",1,"Экзамен","2015/2016 учебный год 1 модуль",null,9,1,1,0,1017338279,2098,null,"stCommon","Медиакоммуникации",{"$f":"MATCH(D11,Отчет!$C:$C,0)","v":51}]
[1190313825,9,"БМД151",1162391584,"Манусевич","Вероника","Александровна","М151БМКМК053","Безопасность жизнедеятельности",1,"Экзамен","2015/2016 учебный год 1 модуль",null,9,1,1,0,1017338279,2098,null,"stCommon","Медиакоммуникации",{"$f":"MATCH(D12,Отчет!$C:$C,0)","v":114}]
[1190309203,9,"БМД154",1162391612,"Готовцева","Юлия","Владимировна","М151БМКМК020","Безопасность жизнедеятельности",1,"Экзамен","2015/2016 учебный год 1 модуль",null,9,1,1,0,1017338279,2098,null,"stCommon","Медиакоммуникации",{"$f":"MATCH(D13,Отчет!$C:$C,0)","v":75}]
[1178843157,10,"БМД151",1162391648,"Ветрова","Анна","Анатольевна","М151БМКМК013","Безопасность жизнедеятельности",1,"Экзамен","2015/2016 учебный год 1 модуль",null,10,1,1,0,1017338279,2098,null,"stCommon","Медиакоммуникации",{"$f":"MATCH(D14,Отчет!$C:$C,0)","v":73}]
[1190313938,9,"БМД151",1162391682,"Никулова","Ксения","Геннадиевна","М151БМКМК062","Безопасность жизнедеятельности",1,"Экзамен","2015/2016 учебный год 1 модуль",null,9,1,1,0,1017338279,2098,null,"stCommon","Медиакоммуникации",{"$f":"MATCH(D15,Отчет!$C:$C,0)","v":108}]
[1190308286,10,"БМД153",1162391718,"Русскова","Мария","Олеговна","М151БМКМК075","Безопасность жизнедеятельности",1,"Экзамен","2015/2016 учебный год 1 модуль",null,10,1,1,0,1017338279,2098,null,"stCommon","Медиакоммуникации",{"$f":"MATCH(D16,Отчет!$C:$C,0)","v":32}]
[1190313483,10,"БМД151",1162391754,"Диденко","Елена","Валерьевна","М151БМКМК025","Безопасность жизнедеятельности",1,"Экзамен","2015/2016 учебный год 1 модуль",null,10,1,1,0,1017338279,2098,null,"stCommon","Медиакоммуникации",{"$f":"MATCH(D17,Отчет!$C:$C,0)","v":85}]
[1190307708,8,"БМД153",1162391828,"Ковальчук","Валерия","Андреевна","М151БМКМК035","Безопасность жизнедеятельности",1,"Экзамен","2015/2016 учебный год 1 модуль",null,8,1,1,0,1017338279,2098,null,"stCommon","Медиакоммуникации",{"$f":"MATCH(D18,Отчет!$C:$C,0)","v":115}]
[1190307596,9,"БМД153",1162391934,"Дулькина","Варвара","Андреевна","М151БМКМК027","Безопасность жизнедеятельности",1,"Экзамен","2015/2016 учебный год 1 модуль",null,9,1,1,0,1017338279,2098,null,"stCommon","Медиакоммуникации",{"$f":"MATCH(D19,Отчет!$C:$C,0)","v":97}]
[1190309947,9,"БМД154",1162391972,"Осипик","Егор","Васильевич","М151БМКМК064","Безопасность жизнедеятельности",1,"Экзамен","2015/2016 учебный год 1 модуль",null,9,1,1,0,1017338279,2098,null,"stCommon","Медиакоммуникации",{"$f":"MATCH(D20,Отчет!$C:$C,0)","v":87}]
[1190309494,7,"БМД154",1162392006,"Комаров","Дмитрий","Александрович","М151БМКМК036","Безопасность жизнедеятельности",1,"Экзамен","2015/2016 учебный год 1 модуль",null,7,1,1,0,1017338279,2098,null,"stCommon","Медиакоммуникации",{"$f":"MATCH(D21,Отчет!$C:$C,0)","v":123}]
[1190313652,9,"БМД152",1162392044,"Комогорова","Мария","Константиновна","М151БМКМК038","Безопасность жизнедеятельности",1,"Экзамен","2015/2016 учебный год 1 модуль",null,9,1,1,0,1017338279,2098,null,"stCommon","Медиакоммуникации",{"$f":"MATCH(D22,Отчет!$C:$C,0)","v":59}]
[1190307417,9,"БМД153",1162392076,"Брагина","Александра","Игоревна","М151БМКМК011","Безопасность жизнедеятельности",1,"Экзамен","2015/2016 учебный год 1 модуль",null,9,1,1,0,1017338279,2098,null,"stCommon","Медиакоммуникации",{"$f":"MATCH(D23,Отчет!$C:$C,0)","v":120}]
[1190310174,9,"БМД154",1162392114,"Солодникова","Валентина","Валерьевна","М151БМКМК084","Безопасность жизнедеятельности",1,"Экзамен","2015/2016 учебный год 1 модуль",null,9,1,1,0,1017338279,2098,null,"stCommon","Медиакоммуникации",{"$f":"MATCH(D24,Отчет!$C:$C,0)","v":118}]
[1190313882,8,"БМД151",1162390585,"Моренко","Петр","Станиславович","М151БМКМК057","Безопасность жизнедеятельности",1,"Экзамен","2015/2016 учебный год 1 модуль",null,8,1,1,0,1017338279,2098,null,"stCommon","Медиакоммуникации",{"$f":"MATCH(D25,Отчет!$C:$C,0)","v":111}]
[1190309263,9,"БМД154",1181089083,"Гребнева","Мария","-","М151БМКМК113","Безопасность жизнедеятельности",1,"Экзамен","2015/2016 учебный год 1 модуль",null,9,1,1,1,1017338279,2098,null,"stCommon","Медиакоммуникации",{"$f":"MATCH(D26,Отчет!$C:$C,0)","v":25}]
[1190315160,9,"БМД152",1181089117,"Бусурманов","Арсен","Жыргалбаевич","М151БМКМК106","Безопасность жизнедеятельности",1,"Экзамен","2015/2016 учебный год 1 модуль",null,9,1,1,1,1017338279,2098,null,"stCommon","Медиакоммуникации",{"$f":"MATCH(D27,Отчет!$C:$C,0)","v":124}]
[1190315328,9,"БМД152",1181089100,"Геренюк","Инесса","Вадимовна","М151БМКМК107","Безопасность жизнедеятельности",1,"Экзамен","2015/2016 учебный год 1 модуль",null,9,1,1,1,1017338279,2098,null,"stCommon","Медиакоммуникации",{"$f":"MATCH(D28,Отчет!$C:$C,0)","v":28}]
[1190316263,9,"БМД152",1181073324,"Рыльникова","Анна","Валентиновна","М151БМКМК109","Безопасность жизнедеятельности",1,"Экзамен","2015/2016 учебный год 1 модуль",null,9,1,1,0,1017338279,2098,null,"stCommon","Медиакоммуникации",{"$f":"MATCH(D29,Отчет!$C:$C,0)","v":60}]
[1256501708,8,"БМД154",1254125816,"Чернышова","Екатерина","Евгеньевна","М141БФИЛЛ073","Безопасность жизнедеятельности",1,"Экзамен","2015/2016 учебный год 1 модуль",null,8,1,1,0,1017338279,2098,"ikPassed","stCommon","Медиакоммуникации",{"$f":"MATCH(D30,Отчет!$C:$C,0)","v":94}]
[1190313596,9,"БМД151",1162392583,"Карзанова","Елена","Станиславовна","М151БМКМК033","Безопасность жизнедеятельности",1,"Экзамен","2015/2016 учебный год 1 модуль",null,9,1,1,0,1017338279,2098,null,"stCommon","Медиакоммуникации",{"$f":"MATCH(D31,Отчет!$C:$C,0)","v":29}]
[1190308622,9,"БМД153",1162394673,"Феер","Наталья","Ивановна","М151БМКМК093","Безопасность жизнедеятельности",1,"Экзамен","2015/2016 учебный год 1 модуль",null,9,1,1,1,1017338279,2098,null,"stCommon","Медиакоммуникации",{"$f":"MATCH(D32,Отчет!$C:$C,0)","v":22}]
[1190313994,9,"БМД151",1162394434,"Панасенко","Юлия","Владимировна","М151БМКМК065","Безопасность жизнедеятельности",1,"Экзамен","2015/2016 учебный год 1 модуль",null,9,1,1,1,1017338279,2098,null,"stCommon","Медиакоммуникации",{"$f":"MATCH(D33,Отчет!$C:$C,0)","v":67}]
[1190314220,8,"БМД151",1162390707,"Печерских","Вячеслав","Игоревич","М151БМКМК071","Безопасность жизнедеятельности",1,"Экзамен","2015/2016 учебный год 1 модуль",null,8,1,1,0,1017338279,2098,null,"stCommon","Медиакоммуникации",{"$f":"MATCH(D34,Отчет!$C:$C,0)","v":103}]
[1190314444,9,"БМД151",1162394403,"Строкан","Дарья","Алексеевна","М151БМКМК085","Безопасность жизнедеятельности",1,"Экзамен","2015/2016 учебный год 1 модуль",null,9,1,1,1,1017338279,2098,null,"stCommon","Медиакоммуникации",{"$f":"MATCH(D35,Отчет!$C:$C,0)","v":90}]
[1190314612,9,"БМД151",1162391792,"Шпайхер","Виктория","Владиславовна","М151БМКМК101","Безопасность жизнедеятельности",1,"Экзамен","2015/2016 учебный год 1 модуль",null,9,1,1,0,1017338279,2098,null,"stCommon","Медиакоммуникации",{"$f":"MATCH(D36,Отчет!$C:$C,0)","v":79}]
[1190316150,9,"БМД152",1162394705,"Петрова","Полина","Владимировна","М151БМКМК070","Безопасность жизнедеятельности",1,"Экзамен","2015/2016 учебный год 1 модуль",null,9,1,1,1,1017338279,2098,null,"stCommon","Медиакоммуникации",{"$f":"MATCH(D37,Отчет!$C:$C,0)","v":70}]
[1190316431,9,"БМД152",1162391408,"Суворова","Юлия","Денисовна","М151БМКМК086","Безопасность жизнедеятельности",1,"Экзамен","2015/2016 учебный год 1 модуль",null,9,1,1,0,1017338279,2098,null,"stCommon","Медиакоммуникации",{"$f":"MATCH(D38,Отчет!$C:$C,0)","v":61}]
[1190307894,10,"БМД153",1162391273,"Лемтюгина","Юлия","Андреевна","М151БМКМК047","Безопасность жизнедеятельности",1,"Экзамен","2015/2016 учебный год 1 модуль",null,10,1,1,0,1017338279,2098,null,"stCommon","Медиакоммуникации",{"$f":"MATCH(D39,Отчет!$C:$C,0)","v":104}]
[1190308118,9,"БМД153",1162392550,"Меркурьев","Данила","Дмитриевич","М151БМКМК056","Безопасность жизнедеятельности",1,"Экзамен","2015/2016 учебный год 1 модуль",null,9,1,1,0,1017338279,2098,null,"stCommon","Медиакоммуникации",{"$f":"MATCH(D40,Отчет!$C:$C,0)","v":117}]
{"$rows_left_out":792}