{"text_format":"1","workbook":"xlsx","n_sheets":2,"sheets":["Отчет","Данные"],"not_rendered":{"charts":0,"images":1,"macros":1,"external_links":0,"defined_names":0,"comments":0,"pivot_tables":0},"unopened":[],"bounds":{"document_bytes":16777216,"sheet_cells":100000,"rows_first":2000,"rows_last":500,"rows_between":2000,"halvings":0,"cell_chars":16384,"cell_head_chars":4096},"cells_cut":0,"cells_raw":0,"read":"whole","date_system":"1900"}

{"sheet":"Отчет","index":0,"n_rows":110,"n_cols":49,"rows_kept":110,"cut":false,"hidden":false,"merged":[[68,0,69,0],[79,0,80,0],[49,0,50,0],[53,0,54,0],[61,0,62,0],[63,0,64,0],[66,0,67,0],[32,0,33,0],[34,0,36,0],[38,0,39,0],[43,0,45,0],[46,0,48,0],[14,0,16,0],[17,0,19,0],[21,0,22,0],[24,0,25,0],[30,0,31,0],[7,6,10,6],[7,47,10,47],[10,0,10,3],[7,13,10,13],[7,4,10,4],[7,7,10,7],[7,0,9,0],[7,3,9,3],[7,12,10,12],[7,5,10,5],[7,1,9,1],[8,14,8,16],[7,14,7,17],[0,10,0,13],[7,11,10,11],[7,9,10,9],[7,2,9,2],[7,10,10,10],[7,8,10,8],[1,10,2,13],[8,18,8,44],[7,18,7,46],[8,45,8,46]]}
["Текущий рейтинг студентов (до пересдач)",null,null,null,null,null,null,null,null,null,"Приложение 3"]
["Дата выгрузки: 18.01.2017",null,null,null,null,null,null,null,null,null,"к Положению о рейтинговой системе комплексной оценки знаний студентов "]
["Период: c 2016/2017 учебный год I семестр по 2016/2017 учебный год I семестр"]
["Факультет/отделение: Факультет коммуникаций, медиа и дизайна"]
["Направление подготовки: Реклама и связи с общественностью"]
["Уровень образования, номер курса: Бакалавриат 2 курс",null,null,null,null,null,null,null,null,null,null,null,null,null,null," - студенты имеющие задолженности"]
[null,null,null,null,null,null,null,null,null,null,null,null,null,null,"*"," - изучение по ИУП"]
["Место","Студент","Группа","Образовательная программа студента","Кредитно-рейтинговая оценка","Нормировочный коэффициент","Сумма всех кредитов ","Нормированная кредитно-рейтинговая оценка","Сумма всех оценок","Количество всех оценок","Средний балл","Минимальный балл","Наличие неудовлетворительных оценок и неявок","Количество удовлетворительных оценок","2016/2017 учебный год 1 модуль",null,null,null,"2016/2017 учебный год 2 модуль",null,null,null,null,null,null,null,null,null,null,null,null,null,null,null,null,null,null,null,null,null,null,null,null,null,null,null,null,"Номер места"]
[null,null,null,null,null,null,null,null,null,null,null,null,null,null,"Экзамен",null,null,"Зачет","Экзамен",null,null,null,null,null,null,null,null,null,null,null,null,null,null,null,null,null,null,null,null,null,null,null,null,null,null,"Зачет"]
[null,null,null,null,null,null,null,null,null,null,null,null,null,null,"Безопасность жизнедеятельности","Логика","Основы маркетинга","Основы маркетинга","Английский язык","Астрофизика","Введение в программирование","Введение в специальность","Введение в урбанистику","Великие книги западной литературы от Гомера до Ницше","История","История коммуникаций","История международных отношений","Культура современных обществ: социологический анализ.","Логика и основы критического мышления","Микроэкономика","Научно-исследовательский семинар","Научно-исследовательский семинар","Научно-исследовательский семинар","Основы права","Основы теории коммуникаций (Часть 1)","Основы теории организации и управление персоналом","Правовые основы бизнеса","Психология личности и индивидуальных различий","Современная российская политика","Современные информационные технологии","Современный культурный процесс","Социология массовых коммуникаций","Теория государства и права","Теория государства и права","Философия","Научно-исследовательский семинар","Физическая культура"]
["Число текущих кредитов:",null,null,null,null,null,null,null,null,null,null,null,null,null,1,3,3,3,4,5,5,5,5,5,4,4,5,5,5,5,1.33,2,2.08,5,3,5,5,5,5,5,5,3,3,4,4,2,0]
[1,"Мазур Екатерина Сергеевна","БРО151","Реклама и связи с общественностью",224,{"$f":"IF(G12 > 0, MAX(G$12:G$110) / G12, 0)","v":1.6556521739130434},23,{"$f":"E12*F12","v":370.86608695652171},78,8,{"$f":"IF(J12 > 0,I12/J12,0)","v":9.75},{"$f":"MIN($O12:AU12)","v":9},null,8,null,null,10,null,10,null,null,null,null,null,null,null,null,10,null,null,null,10,null,null,9,null,null,null,null,null,null,10,9,null,null,null,"+",1,"ОК"]
[2,"Бешанова Елизавета Вячеславовна","БРО152","Реклама и связи с общественностью",209,{"$f":"IF(G13 > 0, MAX(G$12:G$110) / G13, 0)","v":1.6556521739130434},23,{"$f":"E13*F13","v":346.03130434782605},63,7,{"$f":"IF(J13 > 0,I13/J13,0)","v":9},{"$f":"MIN($O13:AU13)","v":8},null,7,null,null,9,null,10,null,null,null,null,null,null,null,9,null,null,null,null,8,null,null,9,null,null,null,null,null,null,9,9,null,null,null,"+",2,"ОК"]
[3,"Щелкунов Игорь Владимирович","БРО153","Реклама и связи с общественностью",202,{"$f":"IF(G14 > 0, MAX(G$12:G$110) / G14, 0)","v":1.6556521739130434},23,{"$f":"E14*F14","v":334.44173913043477},61,7,{"$f":"IF(J14 > 0,I14/J14,0)","v":8.7142857142857135},{"$f":"MIN($O14:AU14)","v":7},null,7,null,null,9,null,10,null,null,null,9,null,null,null,null,null,null,null,null,9,null,null,9,null,null,null,null,null,null,8,7,null,null,null,"+",3,"ОК"]
["4 - 6","Калабаева Дарья Андреевна","БРО152","Реклама и связи с общественностью",201,{"$f":"IF(G15 > 0, MAX(G$12:G$110) / G15, 0)","v":1.6556521739130434},23,{"$f":"E15*F15","v":332.78608695652173},61,7,{"$f":"IF(J15 > 0,I15/J15,0)","v":8.7142857142857135},{"$f":"MIN($O15:AU15)","v":8},null,7,null,null,10,null,9,null,null,null,null,null,null,null,null,null,null,null,null,9,null,null,8,null,null,null,null,null,9,8,8,null,null,null,"+",4,"ОК"]
[null,"Кимлык Мария Андреевна","БРО153","Реклама и связи с общественностью",201,{"$f":"IF(G16 > 0, MAX(G$12:G$110) / G16, 0)","v":1.6556521739130434},23,{"$f":"E16*F16","v":332.78608695652173},61,7,{"$f":"IF(J16 > 0,I16/J16,0)","v":8.7142857142857135},{"$f":"MIN($O16:AU16)","v":8},null,7,null,null,10,null,8,null,null,null,null,null,null,null,null,null,null,null,null,8,null,null,9,null,9,null,null,null,null,9,8,null,null,null,"+",5,"ОК"]
[null,"Курганова Диана Андреевна","БРО153","Реклама и связи с общественностью",201,{"$f":"IF(G17 > 0, MAX(G$12:G$110) / G17, 0)","v":1.6556521739130434},23,{"$f":"E17*F17","v":332.78608695652173},60,7,{"$f":"IF(J17 > 0,I17/J17,0)","v":8.5714285714285712},{"$f":"MIN($O17:AU17)","v":7},null,7,null,null,10,null,10,null,null,null,null,null,null,null,null,null,null,null,null,7,null,null,9,null,null,null,null,null,null,8,7,null,null,null,"+",6,"ОК"]
["7 - 9","Попова Диана Александровна","БРО152","Реклама и связи с общественностью",200,{"$f":"IF(G18 > 0, MAX(G$12:G$110) / G18, 0)","v":1.6556521739130434},23,{"$f":"E18*F18","v":331.13043478260869},61,7,{"$f":"IF(J18 > 0,I18/J18,0)","v":8.7142857142857135},{"$f":"MIN($O18:AU18)","v":8},null,7,null,null,9,null,8,null,null,null,null,null,null,null,9,null,null,null,null,9,null,null,9,null,null,null,null,null,null,9,8,null,null,null,"+",7,"ОК"]
[null,"Мошева Анастасия Олеговна","БРО153","Реклама и связи с общественностью",200,{"$f":"IF(G19 > 0, MAX(G$12:G$110) / G19, 0)","v":1.6556521739130434},23,{"$f":"E19*F19","v":331.13043478260869},60,7,{"$f":"IF(J19 > 0,I19/J19,0)","v":8.5714285714285712},{"$f":"MIN($O19:AU19)","v":6},null,7,null,null,9,null,10,null,null,null,null,null,null,null,null,null,null,9,null,8,null,null,9,null,null,null,null,null,null,9,6,null,null,null,"+",8,"ОК"]
[null,"Гранина Дарья Константиновна","БРО153","Реклама и связи с общественностью",200,{"$f":"IF(G20 > 0, MAX(G$12:G$110) / G20, 0)","v":1.6556521739130434},23,{"$f":"E20*F20","v":331.13043478260869},59,7,{"$f":"IF(J20 > 0,I20/J20,0)","v":8.4285714285714288},{"$f":"MIN($O20:AU20)","v":6},null,7,null,null,8,null,10,null,null,null,10,null,null,null,null,null,null,null,null,7,null,null,9,null,null,null,null,null,null,9,6,null,null,null,"+",9,"ОК"]
[10,"Жарикова Анастасия Владимировна","БРО152","Реклама и связи с общественностью",318.64,{"$f":"IF(G21 > 0, MAX(G$12:G$110) / G21, 0)","v":1.0269687162891046},37.08,{"$f":"E21*F21","v":327.23331175836029},95,11,{"$f":"IF(J21 > 0,I21/J21,0)","v":8.6363636363636367},{"$f":"MIN($O21:AU21)","v":8},null,11,null,"7 *",10,null,8,null,null,"8 *",null,null,"7 *",null,null,10,null,null,null,10,"8 *",null,9,null,null,null,null,null,null,9,9,null,null,null,"+",10,"ОК"]
["11 - 12","Сковородина Елизавета Сергеевна","БРО153","Реклама и связи с общественностью",196,{"$f":"IF(G22 > 0, MAX(G$12:G$110) / G22, 0)","v":1.6556521739130434},23,{"$f":"E22*F22","v":324.50782608695653},59,7,{"$f":"IF(J22 > 0,I22/J22,0)","v":8.4285714285714288},{"$f":"MIN($O22:AU22)","v":8},null,7,null,null,8,null,9,null,null,null,null,null,null,null,null,null,9,null,null,8,null,null,8,null,null,null,null,null,null,9,8,null,null,null,"+",11,"ОК"]
[null,"Язькова Елизавета Алексеевна","БРО153","Реклама и связи с общественностью",196,{"$f":"IF(G23 > 0, MAX(G$12:G$110) / G23, 0)","v":1.6556521739130434},23,{"$f":"E23*F23","v":324.50782608695653},59,7,{"$f":"IF(J23 > 0,I23/J23,0)","v":8.4285714285714288},{"$f":"MIN($O23:AU23)","v":7},null,7,null,null,9,null,9,null,null,null,null,null,null,null,null,null,null,null,null,8,null,null,9,null,9,null,null,null,null,8,7,null,null,null,"+",12,"ОК"]
[13,"Казакова Виктория Владимировна","БРО151","Реклама и связи с общественностью",193,{"$f":"IF(G24 > 0, MAX(G$12:G$110) / G24, 0)","v":1.6556521739130434},23,{"$f":"E24*F24","v":319.54086956521741},59,7,{"$f":"IF(J24 > 0,I24/J24,0)","v":8.4285714285714288},{"$f":"MIN($O24:AU24)","v":7},null,7,null,null,7,null,9,null,null,null,null,null,null,null,null,8,null,null,null,9,null,null,9,null,null,null,null,null,null,9,8,null,null,null,"+",13,"ОК"]
["14 - 15","Криницкая Анастасия Сергеевна","БРО152","Реклама и связи с общественностью",190,{"$f":"IF(G25 > 0, MAX(G$12:G$110) / G25, 0)","v":1.6556521739130434},23,{"$f":"E25*F25","v":314.57391304347823},58,7,{"$f":"IF(J25 > 0,I25/J25,0)","v":8.2857142857142865},{"$f":"MIN($O25:AU25)","v":6},null,7,null,null,8,null,6,null,null,null,null,null,null,null,null,null,null,null,null,8,null,null,9,null,null,null,null,null,null,10,8,null,null,null,"+",14,"ОК"]
[null,"Никитина Валерия Дмитриевна","БРО152","Реклама и связи с общественностью",190,{"$f":"IF(G26 > 0, MAX(G$12:G$110) / G26, 0)","v":1.6556521739130434},23,{"$f":"E26*F26","v":314.57391304347823},58,7,{"$f":"IF(J26 > 0,I26/J26,0)","v":8.2857142857142865},{"$f":"MIN($O26:AU26)","v":6},null,7,null,null,9,null,9,null,null,null,null,null,null,null,8,null,null,null,null,9,null,null,8,null,null,null,null,null,null,9,6,null,null,null,"+",15,"ОК"]
[16,"Колганова Полина Олеговна","БРО151","Реклама и связи с общественностью",188,{"$f":"IF(G27 > 0, MAX(G$12:G$110) / G27, 0)","v":1.6556521739130434},23,{"$f":"E27*F27","v":311.26260869565215},57,7,{"$f":"IF(J27 > 0,I27/J27,0)","v":8.1428571428571423},{"$f":"MIN($O27:AU27)","v":7},null,7,null,null,9,null,9,null,null,null,null,null,null,null,null,8,null,null,null,8,null,null,8,null,null,null,null,null,null,8,7,null,null,null,"+",16,"ОК"]
[17,"Садова Анастасия Романовна","БРО151","Реклама и связи с общественностью",187,{"$f":"IF(G28 > 0, MAX(G$12:G$110) / G28, 0)","v":1.6556521739130434},23,{"$f":"E28*F28","v":309.60695652173911},56,7,{"$f":"IF(J28 > 0,I28/J28,0)","v":8},{"$f":"MIN($O28:AU28)","v":6},null,7,null,null,9,null,7,null,null,null,null,null,null,null,null,null,null,null,null,6,null,null,8,null,null,9,null,null,null,9,8,null,null,null,"+",17,"ОК"]
[18,"Радченко Ирина Дмитриевна","БРО152","Реклама и связи с общественностью",154,{"$f":"IF(G29 > 0, MAX(G$12:G$110) / G29, 0)","v":2.0042105263157892},19,{"$f":"E29*F29","v":308.64842105263153},48,6,{"$f":"IF(J29 > 0,I29/J29,0)","v":8},{"$f":"MIN($O29:AU29)","v":6},null,6,null,null,8,null,null,null,null,null,null,null,null,null,null,null,null,null,null,8,null,null,9,null,null,null,null,null,null,8,6,null,null,null,"+",18,"ОК"]
[19,"Янчева Анастасия Вадимовна","БРО153","Реклама и связи с общественностью",186,{"$f":"IF(G30 > 0, MAX(G$12:G$110) / G30, 0)","v":1.6556521739130434},23,{"$f":"E30*F30","v":307.95130434782607},57,7,{"$f":"IF(J30 > 0,I30/J30,0)","v":8.1428571428571423},{"$f":"MIN($O30:AU30)","v":6},null,7,null,null,7,null,10,null,null,null,null,null,null,null,null,null,null,7,null,9,null,null,9,null,null,null,null,null,null,9,6,null,null,null,"+",19,"ОК"]
{"$rows_left_out":81}
{"sheet":"Данные","index":1,"n_rows":862,"n_cols":21,"rows_kept":862,"cut":false,"hidden":true,"merged":[]}
["ID","Оценка из 10 баллов до пересдач","Группа","Студент","Фамилия Имя Отчество","Номер студенческого билета","Строка учебного плана","Текущих кредитов за испытание","Вид испытания","Календарный период по плану","Неявка до пересдач","В текущий рейтинг","Текущих кредитов для студента","Оценка зачет/незачет до пересдач","Является бюджетным","Учебный план","Вид записи РУП","Вид записи ИУП","Номер Row"]
[1,2,3,4,5,6,7,8,9,10,11,12,13,14,15,16,17,18,19]
[1623541660,9,"БРО153",1514792971,"Гридчина Нина Сергеевна","М161БРИСО001","Безопасность жизнедеятельности",1,"Экзамен","2016/2017 учебный год 1 модуль",null,9,1,1,0,1520802210,2098,"ikFirst","stCommon","Реклама и связи с общественностью",{"$f":"MATCH(D3,Отчет!#REF!,0)","v":{"$error":"#REF!"}}]
[1623481421,4,"БРО151",1474053891,"Лисина Юлия Андреевна","М151БРИСО086","Безопасность жизнедеятельности",1,"Экзамен","2016/2017 учебный год 1 модуль",null,4,1,1,0,1520802210,2098,"ikFirst","stCommon","Реклама и связи с общественностью",{"$f":"MATCH(D4,Отчет!#REF!,0)","v":{"$error":"#REF!"}}]
[1623504752,5,"БРО151",1516201234,"Чернышева Юлия Ивановна","М151БЛУЦП132","Логика",3,"Экзамен","2016/2017 учебный год 1 модуль",null,15,3,1,0,1520802210,2098,"ikFirst","stCommon","Реклама и связи с общественностью",{"$f":"MATCH(D5,Отчет!#REF!,0)","v":{"$error":"#REF!"}}]
[1623537978,7,"БРО152",1517704476,"Жарикова Анастасия Владимировна","М151БМНДЖ057","Логика",3,"Экзамен","2016/2017 учебный год 1 модуль",null,21,3,1,0,1520802210,2098,"ikFirst","stCommon","Реклама и связи с общественностью",{"$f":"MATCH(D6,Отчет!#REF!,0)","v":{"$error":"#REF!"}}]
[1649669770,1,"БРО151",1649667663,"Селиверстова Анастасия Алексеевна","13151224","Логика",3,"Экзамен","2016/2017 учебный год 1 модуль",null,0,3,0,0,1520802210,2098,"ikFirst","stCommon","Реклама и связи с общественностью",{"$f":"MATCH(D7,Отчет!#REF!,0)","v":{"$error":"#REF!"}}]
[1652986358,3,"БРО152",1652970670,"Абрамов Александр Олегович","13151201","Логика",3,"Экзамен","2016/2017 учебный год 1 модуль",null,0,3,0,0,1520802210,2098,"ikFirst","stCommon","Реклама и связи с общественностью",{"$f":"MATCH(D8,Отчет!#REF!,0)","v":{"$error":"#REF!"}}]
[1623481430,0,"БРО151",1474053891,"Лисина Юлия Андреевна","М151БРИСО086","Логика",3,"Экзамен","2016/2017 учебный год 1 модуль",null,0,3,0,0,1520802210,2098,"ikFirst","stCommon","Реклама и связи с общественностью",{"$f":"MATCH(D9,Отчет!#REF!,0)","v":{"$error":"#REF!"}}]
[1623541668,4,"БРО153",1514792971,"Гридчина Нина Сергеевна","М161БРИСО001","Логика",3,"Экзамен","2016/2017 учебный год 1 модуль",null,12,3,1,0,1520802210,2098,"ikFirst","stCommon","Реклама и связи с общественностью",{"$f":"MATCH(D10,Отчет!#REF!,0)","v":{"$error":"#REF!"}}]
[1580583500,9,"БРО151",1181086716,"Пономарева Елизавета","М151БРИСО077","Основы маркетинга",3,"Экзамен","2016/2017 учебный год 1 модуль",null,27,3,1,1,1520829000,2098,null,"stCommon","Реклама и связи с общественностью",{"$f":"MATCH(D11,Отчет!#REF!,0)","v":{"$error":"#REF!"}}]
[1580590606,10,"БРО153",1181086733,"Дремлюк Марья","М151БРИСО074","Основы маркетинга",3,"Экзамен","2016/2017 учебный год 1 модуль",null,30,3,1,1,1520829000,2098,null,"stCommon","Реклама и связи с общественностью",{"$f":"MATCH(D12,Отчет!#REF!,0)","v":{"$error":"#REF!"}}]
[1580582478,7,"БРО151",1181086750,"Даниленко Ярослав","М151БРИСО078","Основы маркетинга",3,"Экзамен","2016/2017 учебный год 1 модуль",null,21,3,1,1,1520829000,2098,null,"stCommon","Реклама и связи с общественностью",{"$f":"MATCH(D13,Отчет!#REF!,0)","v":{"$error":"#REF!"}}]
[1580587680,8,"БРО152",1181086767,"Мухортова Дарья Александровна","М151БРИСО072","Основы маркетинга",3,"Экзамен","2016/2017 учебный год 1 модуль",null,24,3,1,1,1520829000,2098,null,"stCommon","Реклама и связи с общественностью",{"$f":"MATCH(D14,Отчет!#REF!,0)","v":{"$error":"#REF!"}}]
[1580591071,8,"БРО153",1181086818,"Кунцевич Мария","М151БРИСО076","Основы маркетинга",3,"Экзамен","2016/2017 учебный год 1 модуль",null,24,3,1,1,1520829000,2098,null,"stCommon","Реклама и связи с общественностью",{"$f":"MATCH(D15,Отчет!#REF!,0)","v":{"$error":"#REF!"}}]
[1572906350,7,"БРО151",1187793549,"Абдулхакимова Афина Шавкатовна","М151БРИСО084","Основы маркетинга",3,"Экзамен","2016/2017 учебный год 1 модуль",null,21,3,1,0,1520829000,2098,null,"stCommon","Реклама и связи с общественностью",{"$f":"MATCH(D16,Отчет!#REF!,0)","v":{"$error":"#REF!"}}]
[1580591744,9,"БРО153",1187938514,"Романова Екатерина Сергеевна","М151БРИСО082","Основы маркетинга",3,"Экзамен","2016/2017 учебный год 1 модуль",null,27,3,1,1,1520829000,2098,null,"stCommon","Реклама и связи с общественностью",{"$f":"MATCH(D17,Отчет!#REF!,0)","v":{"$error":"#REF!"}}]
[1580587035,8,"БРО152",1187938540,"Ковалева Анастасия Романовна","М151БРИСО080","Основы маркетинга",3,"Экзамен","2016/2017 учебный год 1 модуль",null,24,3,1,1,1520829000,2098,null,"stCommon","Реклама и связи с общественностью",{"$f":"MATCH(D18,Отчет!#REF!,0)","v":{"$error":"#REF!"}}]
[1580582130,7,"БРО151",1192491796,"Бекназарова Комилла Сохибжоновна","М151БРИСО085","Основы маркетинга",3,"Экзамен","2016/2017 учебный год 1 модуль",null,21,3,1,1,1520829000,2098,null,"stCommon","Реклама и связи с общественностью",{"$f":"MATCH(D19,Отчет!#REF!,0)","v":{"$error":"#REF!"}}]
[1580585626,6,"БРО152",1322382992,"Авилова Виктория Борисовна","131236028","Основы маркетинга",3,"Экзамен","2016/2017 учебный год 1 модуль",null,18,3,1,0,1520829000,2098,null,"stCommon","Реклама и связи с общественностью",{"$f":"MATCH(D20,Отчет!#REF!,0)","v":{"$error":"#REF!"}}]
[1580586500,7,"БРО152",1396053703,"Громов Максим Сергеевич","М141БФИКЛ012","Основы маркетинга",3,"Экзамен","2016/2017 учебный год 1 модуль",null,21,3,1,0,1520829000,2098,null,"stCommon","Реклама и связи с общественностью",{"$f":"MATCH(D21,Отчет!#REF!,0)","v":{"$error":"#REF!"}}]
[1580582844,8,"БРО151",1474053891,"Лисина Юлия Андреевна","М151БРИСО086","Основы маркетинга",3,"Экзамен","2016/2017 учебный год 1 модуль",null,24,3,1,0,1520829000,2098,null,"stCommon","Реклама и связи с общественностью",{"$f":"MATCH(D22,Отчет!#REF!,0)","v":{"$error":"#REF!"}}]
[1580592199,8,"БРО153",1514787326,"Харисов Артур Раоланович","М151БЭКСТ107","Основы маркетинга",3,"Экзамен","2016/2017 учебный год 1 модуль",null,24,3,1,0,1520829000,2098,null,"stCommon","Реклама и связи с общественностью",{"$f":"MATCH(D23,Отчет!#REF!,0)","v":{"$error":"#REF!"}}]
[1580590389,9,"БРО153",1514792971,"Гридчина Нина Сергеевна","М161БРИСО001","Основы маркетинга",3,"Экзамен","2016/2017 учебный год 1 модуль",null,27,3,1,0,1520829000,2098,null,"stCommon","Реклама и связи с общественностью",{"$f":"MATCH(D24,Отчет!#REF!,0)","v":{"$error":"#REF!"}}]
[1580590767,7,"БРО153",1514839183,"Жаркова Дарья Андреевна","М151БСОЦЛ040","Основы маркетинга",3,"Экзамен","2016/2017 учебный год 1 модуль",null,21,3,1,0,1520829000,2098,null,"stCommon","Реклама и связи с общественностью",{"$f":"MATCH(D25,Отчет!#REF!,0)","v":{"$error":"#REF!"}}]
[1580583839,9,"БРО151",1515445555,"Скворцова Елизавета Васильевна","М161БРИСО395","Основы маркетинга",3,"Экзамен","2016/2017 учебный год 1 модуль",null,27,3,1,0,1520829000,2098,null,"stCommon","Реклама и связи с общественностью",{"$f":"MATCH(D26,Отчет!#REF!,0)","v":{"$error":"#REF!"}}]
[1580581857,8,"БРО151",1515481958,"Бажулич Кристина Джуровна","М151БИНЯЗ017","Основы маркетинга",3,"Экзамен","2016/2017 учебный год 1 модуль",null,24,3,1,0,1520829000,2098,null,"stCommon","Реклама и связи с общественностью",{"$f":"MATCH(D27,Отчет!#REF!,0)","v":{"$error":"#REF!"}}]
[1580584383,8,"БРО151",1516201234,"Чернышева Юлия Ивановна","М151БЛУЦП132","Основы маркетинга",3,"Экзамен","2016/2017 учебный год 1 модуль",null,24,3,1,0,1520829000,2098,null,"stCommon","Реклама и связи с общественностью",{"$f":"MATCH(D28,Отчет!#REF!,0)","v":{"$error":"#REF!"}}]
[1580582928,8,"БРО151",1517364590,"Луданова Евгения Александровна","М151БМИЭФ103","Основы маркетинга",3,"Экзамен","2016/2017 учебный год 1 модуль",null,24,3,1,0,1520829000,2098,null,"stCommon","Реклама и связи с общественностью",{"$f":"MATCH(D29,Отчет!#REF!,0)","v":{"$error":"#REF!"}}]
[1580584293,7,"БРО151",1517365582,"Хохлова Наталия Алексеевна","М151БМИЭФ196","Основы маркетинга",3,"Экзамен","2016/2017 учебный год 1 модуль",null,21,3,1,0,1520829000,2098,null,"stCommon","Реклама и связи с общественностью",{"$f":"MATCH(D30,Отчет!#REF!,0)","v":{"$error":"#REF!"}}]
{"$rows_left_out":832}