{"text_format":"1","workbook":"xlsx","n_sheets":2,"sheets":["Отчет","Данные"],"not_rendered":{"charts":0,"images":1,"macros":1,"external_links":0,"defined_names":0,"comments":0,"pivot_tables":0},"unopened":[],"bounds":{"document_bytes":16777216,"sheet_cells":100000,"rows_first":2000,"rows_last":500,"rows_between":2000,"halvings":0,"cell_chars":16384,"cell_head_chars":4096},"cells_cut":0,"cells_raw":0,"read":"whole","date_system":"1900"}

{"sheet":"Отчет","index":0,"n_rows":76,"n_cols":136,"rows_kept":76,"cut":false,"hidden":false,"merged":[[49,0,50,0],[58,0,59,0],[8,67,8,121],[7,67,7,134],[8,122,8,134],[16,0,17,0],[29,0,30,0],[42,0,43,0],[8,20,8,53],[7,20,7,55],[8,54,8,55],[8,56,8,64],[7,56,7,66],[8,65,8,66],[7,3,9,3],[7,2,9,2],[7,1,9,1],[7,15,10,15],[7,6,9,6],[7,4,9,4],[7,14,10,14],[7,5,9,5],[7,18,7,19],[8,18,8,19],[7,17,10,17],[7,13,10,13],[7,9,10,9],[10,0,10,6],[7,8,10,8],[7,11,10,11],[7,12,10,12],[7,16,10,16],[7,0,9,0],[7,10,10,10]]}
["Текущий рейтинг студентов после пересдач"]
["Дата выгрузки: 14.07.2017"]
["Период: c 2016/2017 учебный год I семестр по 2016/2017 учебный год II семестр"]
["Факультет/отделение: Факультет мировой экономики и мировой политики"]
["Направление  подготовки: \"Международные отношения\""]
["Уровень образования, номер курса: Бакалавриат 2 курс",null,null,null,null,null,null,null,null,null,null,null,null,null,null,null,null,null,null,null," - студенты имеющие задолженности"]
[null,null,null,null,null,null,null,null,null,null,null,null,null,null,null,null,null,null,null,"*"," - изучение по ИУП"]
["Место","Номер зачетной книжки","Студент","ID","Группа","Образовательная программа студента","Вид места",null,"Кредитно-рейтинговая оценка","Нормировочный коэффициент","Сумма всех кредитов ","Нормированная\n кредитно-рейтинговая оценка","Сумма оценок","Количество оценок","Средний балл","Минимальный балл","Наличие задодженнстей","Номер места","2016/2017 учебный год 1 модуль",null,"2016/2017 учебный год 2 модуль",null,null,null,null,null,null,null,null,null,null,null,null,null,null,null,null,null,null,null,null,null,null,null,null,null,null,null,null,null,null,null,null,null,null,null,"2016/2017 учебный год 3 модуль",null,null,null,null,null,null,null,null,null,null,"2016/2017 учебный год 4 модуль"]
[null,null,null,null,null,null,null,null,null,null,null,null,null,null,null,null,null,null,"Зачет",null,"Экзамен",null,null,null,null,null,null,null,null,null,null,null,null,null,null,null,null,null,null,null,null,null,null,null,null,null,null,null,null,null,null,null,null,null,"Зачет",null,"Экзамен",null,null,null,null,null,null,null,null,"Зачет",null,"Экзамен",null,null,null,null,null,null,null,null,null,null,null,null,null,null,null,null,null,null,null,null,null,null,null,null,null,null,null,null,null,null,null,null,null,null,null,null,null,null,null,null,null,null,null,null,null,null,null,null,null,null,null,null,null,null,"Зачет"]
[null,null,null,null,null,null,null,"Номер Row",null,null,null,null,null,null,null,null,null,null,"Проект VI Российско-китайская летняя школа по международным отношениям","Проект Международная конференция Всемирной ассоциации исследователей общественного мнения на тему \"Survey Research and the Study of Social and Cultural Change\"","\"Мягкая сила\" и содействие международному развитию","Английский язык","Английский язык","Введение в программирование","Введение в урбанистику","Великие книги западной литературы от Гомера до Ницше","Власть ключей: ранняя история папства","Глобальные вызовы современности и организация комплексной системы безопасности бизнеса","Иностранный язык (арабский)","Иностранный язык (испанский)","Иностранный язык (итальянский)","Иностранный язык (китайский)","Иностранный язык (немецкий)","Иностранный язык (португальский)","Иностранный язык (французский)","Иностранный язык (японский)","Культура современных обществ: социологический анализ","Логика и основы критического мышления","Мегатренды глобального развития","Международная безопасность: теория и практика","Международное развитие в энергетике","Микроэкономика","Новостная грамотность: новость как объект манипуляции","Основы права","Основы теории организации и управление персоналом","Политическая и экономическая история","Правовые основы бизнеса","Проект Международная модель ЕАЭС НИУ ВШЭ","Психология личности и индивидуальных различий","Россия в современной системе международных отношений","Современная российская политика","Современные информационные технологии","Современный культурный процесс","Теория нейронных сетей","Проект Международная научно-практическая конференция \"Психология бизнеса: теория и практика\"","Физическая культура","Английский язык","Демография","Проект Великие о великом: путеводитель по книгам о мировой экономике и политике","Проект Европейский союз от А до Я","Проект Разработка инновационных туристических маршрутов в регионах Российской Федерации (Калининградская область, Владимирская область, Камчатский край, Республика Алтай)","Проект Разработка инновационных туристических маршрутов в регионах Российской Федерации (Республика Крым, Астраханская область, Архангельская область, Свердловская область)","Проект Разработка инновационных туристических маршрутов в регионах Российской Федерации (Республика Крым, Астраханская область, Архангельская область, Свердловская область)","Французский язык (уровень B1)","Этикет. Деловое общение, корреспонденция, поведение в профессиональной карьере.","Проект Пополнение словаря аляскинского варианта русского языка","Проект Школа авторов журнала «Россия в глобальной политике»","Анализ и моделирование бизнес-процессов","Английский язык","Аудиовизуальные коммуникации: история и современность","Введение в анализ данных","Деловая (конкурентная) разведка. Защита бизнеса от угроз в области экономики и финансов","Иностранный язык (арабский)","Иностранный язык (испанский)","Иностранный язык (итальянский)","Иностранный язык (китайский)","Иностранный язык (немецкий)","Иностранный язык (португальский)","Иностранный язык (французский)","Иностранный язык (японский)","Исламский фундаментализм в современном мире","Конфликты и миротворчество","Курсовые работы","Макроэкономика","Маркетинг","Международные экономические отношения","Мир современной политики: институты и процессы","Научный семинар \"Методология научно-исследовательской работы в области международных отношений\"","Независимый экзамен по английскому языку (2 курс)","Нейроматематика","Основы экономической политики (студенческий семинар Е.Г.Ясина)","Политология и история политических учений","Право собственности и имущество компании","Практическая философия: Что и как определяет человеческие поступки?","Проект SEO-продвижение образовательных продуктов","Проект АТР-экспресс","Проект Арабская весна как триггер глобального фазового перехода","Проект Ближневосточный Клуб НИУ ВШЭ","Проект Европейский союз от А до Я","Проект Иностранный (въездной) туризм в СССР (1929-1991): экономика, политика, идеология","Проект Кто делает новости на постсоветском пространстве?","Проект Лучшие практики и инновации зарубежного образования","Проект Механизмы глобального и регионального регулирования","Проект Новое образование: онлайн-курсы в университетах","Проект Политический ислам в Центральной Азии","Проект Привлечение иностранных студентов: как это сделать?","Проект Профориентационная работа ФМЭиМП со школьниками","Проект Разработка мобильного приложения факультета МЭиМП","Проект Социально-экономическая политика России в глобальном контексте","Проект Социокультурные ценности Японии","Проект Теоретико-методологические подходы к оценке инструментов ускоренного развития Сибири и Дальнего Востока в контексте их интеграции в АТР","Проект Торгово-экономические отношения России со странами Азиатско-тихоокеанского региона","Проект Эволюция радикальных исламистских сообществ на Ближнем востоке и в Центральной Азии после 2011 года","Проект Экономика без загрязнений - мировой опыт и Россия","Проект Экономические процессы и внешнеполитическая ситуация в АТР","Публичное право","Современные средства коммуникации и культура потребления","Социальная психология","Сравнительный анализ интеграционных процессов в мире","Теория международных отношений","Три века русской поэзии","Экономика города и городская инфраструктура","Проект 18 Апрельская международная научная конференция по проблемам развития экономики и общества","Проект 50 оттенков авторитаризма: типологии, институты, стратегии, эффекты, последствия","Проект VII Российско-китайская летняя школа по международным отношениям","Проект Welcome Day факультета мировой экономики и мировой политики","Проект XVIII Апрельская международная научная конференция по проблемам развития экономики и общества","Проект Анализ особенностей управления авиастроительной отраслью в зарубежных странах","Проект Особенности ведения бизнеса в разных странах","Проект Разработка мобильного приложения факультета МЭиМП","Проект Региональное политическое разнообразие в современной России","Проект Регуляторная и нормативная среда в фармацевтической индустрии","Проект Университетские экскурсии","Проект Экскурсии для иностранных студентов","Физическая культура"]
["Число текущих кредитов:",null,null,null,null,null,null,null,null,null,null,null,null,null,null,null,null,null,0,0,3,0,4,5,5,5,2,5,3,3,3,3,3,3,3,3,5,5,3,3,4,5,5,5,5,4,5,4,5,4,5,5,5,5,2,0,2,3,4,4,0,0,5,4,2,0,2,5,4,5,5,5,3,3,3,3,3,3,3,3,4,3,5,5,5,3,5,4,0,5,6,3,5,5,4,4,4,4,4,0,4,4,4,4,0,4,4,0,4,3,4,0,0,4,0,5,5,5,4,4,5,5,0,0,2,1,2,2,4,0,4,7,2,2,0]
[1,"М151БМОТН029","Ларионова Анна Александровна",1171524695,"БМО152","Международные отношения","Бюдж",{"$f":"MATCH(D12,Данные!$D:$D,0)","v":30},664,{"$f":"IF(K12 > 0, MAX(K$12:K$76) / K12, 0)","v":1.0441176470588236},68,{"$f":"I12*J12","v":693.2941176470589},195,20,{"$f":"IF(N12 > 0,M12/N12,0)","v":9.75},{"$f":"MIN($S12:EE12)","v":8},null,20,null,null,10,null,9,null,10,null,null,null,null,null,null,null,10,null,null,null,null,null,10,null,9,null,null,null,null,10,null,null,null,null,null,null,null,null,null,"+",9,10,null,null,null,null,null,null,null,null,null,null,null,null,null,null,null,null,null,null,10,null,null,null,null,null,10,null,null,10,null,10,8,null,null,10,null,null,null,null,null,null,null,null,null,null,null,null,null,null,10,null,null,null,null,null,null,null,null,null,null,null,10,10,null,10,null,null,null,null,null,null,null,null,null,null,null,null,10,1]
[2,"М151БМОТН015","Егорычева Екатерина Ильинична",1171525326,"БМО151","Международные отношения","Комм",{"$f":"MATCH(D13,Данные!$D:$D,0)","v":18},642,{"$f":"IF(K13 > 0, MAX(K$12:K$76) / K13, 0)","v":1.0441176470588236},68,{"$f":"I13*J13","v":670.32352941176475},189,20,{"$f":"IF(N13 > 0,M13/N13,0)","v":9.4499999999999993},{"$f":"MIN($S13:EE13)","v":8},null,20,null,null,10,null,9,null,null,null,null,null,null,null,null,null,null,null,10,null,null,null,10,null,10,null,10,null,null,9,null,null,null,null,null,null,null,null,null,"+",9,10,null,null,null,null,null,null,null,null,null,null,null,9,null,null,null,null,null,null,null,null,10,null,null,null,10,null,null,9,null,10,8,null,null,8,null,null,null,null,null,null,null,null,null,null,null,null,null,null,10,null,null,null,null,null,null,null,null,null,null,null,9,9,null,null,null,null,null,"+",null,null,null,null,null,null,null,null,10,2]
[3,"М151БМОТН014","Дьячкова Дарья Валерьевна",1171524635,"БМО151","Международные отношения","Бюдж",{"$f":"MATCH(D14,Данные!$D:$D,0)","v":29},636,{"$f":"IF(K14 > 0, MAX(K$12:K$76) / K14, 0)","v":1.0441176470588236},68,{"$f":"I14*J14","v":664.05882352941182},187,20,{"$f":"IF(N14 > 0,M14/N14,0)","v":9.35},{"$f":"MIN($S14:EE14)","v":8},null,20,null,null,10,null,9,null,null,null,null,null,null,null,null,null,9,null,null,null,null,null,10,null,9,9,null,null,null,8,null,null,null,null,null,null,null,null,null,"+",9,10,null,null,null,null,null,null,null,null,null,null,null,null,null,null,null,null,null,null,9,null,null,null,null,null,10,10,null,9,null,10,10,null,null,8,null,null,null,null,null,null,10,null,null,null,null,null,null,null,null,null,null,null,null,null,null,null,null,null,null,null,9,9,null,null,null,null,null,null,null,null,null,null,null,null,null,null,10,3]
[4,"М151БМОТН049","Чкадуа Тимерлан Автандилович",1171524867,"БМО152","Международные отношения","Бюдж",{"$f":"MATCH(D15,Данные!$D:$D,0)","v":22},584,{"$f":"IF(K15 > 0, MAX(K$12:K$76) / K15, 0)","v":1.109375},64,{"$f":"I15*J15","v":647.875},183,20,{"$f":"IF(N15 > 0,M15/N15,0)","v":9.15},{"$f":"MIN($S15:EE15)","v":7},null,20,null,null,10,null,8,null,null,null,null,null,null,null,9,null,null,null,null,null,null,null,10,null,10,10,null,null,null,9,null,null,null,null,null,null,null,null,null,"+",8,10,null,null,null,null,null,null,null,null,null,null,null,null,null,null,null,null,9,null,null,null,null,null,null,null,8,10,null,10,null,10,7,null,null,10,null,null,null,null,null,null,null,null,null,null,null,null,null,null,null,null,null,null,null,null,null,null,null,null,null,null,8,8,null,null,null,null,null,null,null,null,9,null,null,null,null,null,10,4]
[5,"М151БМОТН031","Лукашенко Анна Дмитриевна",1171526067,"БМО152","Международные отношения","Бюдж",{"$f":"MATCH(D16,Данные!$D:$D,0)","v":94},618,{"$f":"IF(K16 > 0, MAX(K$12:K$76) / K16, 0)","v":1.0441176470588236},68,{"$f":"I16*J16","v":645.26470588235293},182,20,{"$f":"IF(N16 > 0,M16/N16,0)","v":9.1},{"$f":"MIN($S16:EE16)","v":7},null,20,null,null,null,null,9,null,null,null,null,null,null,null,null,null,10,null,null,null,null,null,7,9,null,null,10,null,null,8,null,null,null,10,null,null,null,null,null,"+",9,10,null,null,null,null,null,null,null,null,null,null,null,9,null,null,null,null,null,null,10,null,null,null,null,8,9,null,null,null,null,10,8,null,null,8,null,null,null,null,null,null,10,null,null,null,null,null,null,null,null,null,null,null,null,null,null,null,null,null,null,null,9,9,null,null,null,null,null,null,null,null,null,null,null,null,null,null,10,5]
["6 - 7","М151БМОТН053","Юхим Инна Михайловна",1171526131,"БМО152","Международные отношения","Бюдж",{"$f":"MATCH(D17,Данные!$D:$D,0)","v":14},613,{"$f":"IF(K17 > 0, MAX(K$12:K$76) / K17, 0)","v":1.0441176470588236},68,{"$f":"I17*J17","v":640.0441176470589},182,20,{"$f":"IF(N17 > 0,M17/N17,0)","v":9.1},{"$f":"MIN($S17:EE17)","v":7},null,20,null,null,10,null,9,null,null,null,null,null,null,null,null,null,null,null,10,null,null,null,8,null,8,9,null,null,null,9,null,null,null,null,null,null,null,null,null,"+",9,10,null,null,null,null,null,null,null,null,null,null,null,null,null,null,null,null,null,null,null,null,10,null,null,null,10,8,null,9,null,9,7,null,null,9,null,null,null,null,null,null,null,null,null,null,null,null,null,null,10,null,null,null,null,null,null,null,null,null,null,null,8,10,null,null,null,null,"нет оценки","+",null,null,null,null,null,null,"+",null,10,6]
[null,"М151БМОТН012","Горшенина Анастасия Сергеевна",1171526099,"БМО151","Международные отношения","Бюдж",{"$f":"MATCH(D18,Данные!$D:$D,0)","v":13},613,{"$f":"IF(K18 > 0, MAX(K$12:K$76) / K18, 0)","v":1.0441176470588236},68,{"$f":"I18*J18","v":640.0441176470589},191,21,{"$f":"IF(N18 > 0,M18/N18,0)","v":9.0952380952380949},{"$f":"MIN($S18:EE18)","v":7},null,21,null,null,9,null,9,10,null,null,null,null,null,null,null,null,null,10,null,null,null,null,8,null,9,null,null,null,null,9,null,null,null,null,null,null,null,null,null,"+",9,10,null,null,null,null,null,null,null,null,null,null,null,null,null,null,null,null,null,null,null,10,null,null,null,null,7,9,null,10,null,10,7,null,null,8,null,null,null,null,null,null,null,null,null,null,null,null,null,null,10,null,null,null,null,null,null,null,null,null,null,null,9,9,null,null,null,null,null,null,null,null,9,null,null,null,null,null,10,7]
[8,"М151БМОТН041","Светличный Владислав Александрович",1171524528,"БМО152","Международные отношения","Бюдж",{"$f":"MATCH(D19,Данные!$D:$D,0)","v":50},569,{"$f":"IF(K19 > 0, MAX(K$12:K$76) / K19, 0)","v":1.109375},64,{"$f":"I19*J19","v":631.234375},178,20,{"$f":"IF(N19 > 0,M19/N19,0)","v":8.9},{"$f":"MIN($S19:EE19)","v":7},null,20,null,null,null,null,8,null,null,null,null,null,8,null,null,null,null,null,null,null,null,null,7,10,null,10,null,null,null,10,null,null,null,10,null,null,null,null,null,"+",8,10,null,null,null,null,null,null,null,null,null,null,null,null,null,null,7,null,null,null,null,null,null,null,null,9,9,9,null,null,null,8,7,null,null,8,null,null,null,null,null,10,null,null,null,null,null,null,null,null,null,null,null,null,null,null,"нет оценки",null,null,null,null,null,10,10,null,null,null,null,null,"+",null,null,null,null,null,null,null,null,10,8]
[9,"М151БМОТН002","Аракелян Данил Эдуардович",1171524954,"БМО151","Международные отношения","Бюдж",{"$f":"MATCH(D20,Данные!$D:$D,0)","v":25},601,{"$f":"IF(K20 > 0, MAX(K$12:K$76) / K20, 0)","v":1.0441176470588236},68,{"$f":"I20*J20","v":627.51470588235293},193,22,{"$f":"IF(N20 > 0,M20/N20,0)","v":8.7727272727272734},{"$f":"MIN($S20:EE20)","v":7},null,22,null,null,9,null,7,null,null,null,10,null,null,null,8,null,null,null,null,null,null,8,8,null,10,null,null,null,null,8,null,null,null,null,null,null,null,null,null,"+",7,8,null,null,null,null,null,null,8,null,null,null,null,null,null,null,null,null,9,null,null,null,null,null,null,null,10,null,null,9,null,10,7,null,null,8,null,10,null,null,null,null,null,null,null,null,10,null,null,null,null,null,null,null,null,null,null,null,null,null,null,null,9,10,null,null,null,null,null,null,null,null,null,null,null,null,null,null,10,9]
{"$rows_left_out":57}
{"sheet":"Данные","index":1,"n_rows":1405,"n_cols":22,"rows_kept":1405,"cut":false,"hidden":true,"merged":[]}
["ID","Оценка из 10 баллов до пересдач","Группа","Студент","Фамилия Имя Отчество","Номер студенческого билета","Строка учебного плана","Текущих кредитов за испытание","Вид испытания","Календарный период по плану","Неявка до пересдач","В текущий рейтинг","Текущих кредитов для студента","Оценка зачет/незачет до пересдач","Является бюджетным","Учебный план","Вид записи РУП","Вид дисциплины по ИУП","Номер Row","Образовательная программа студента"]
[1,2,3,4,5,6,7,8,9,10,11,12,13,14,15,16,17,18,19,20]
[1690216176,10,"БМО152",498441909,"Пульникова Полина Алексеевна","М141БМОТН035","Проект VI Российско-китайская летняя школа по международным отношениям",0,"Зачет","2016/2017 учебный год 1 модуль",null,0,0,1,0,null,null,null,null,0,"Международные отношения",{"$f":"MATCH(D3,Отчет!$D:$D,0)","v":46}]
[1690216180,9,"БМО151",1181077809,"Абдолова Садаф","М151БМОТН063","Проект VI Российско-китайская летняя школа по международным отношениям",0,"Зачет","2016/2017 учебный год 1 модуль",null,0,0,1,1,null,null,null,null,0,"Международные отношения",{"$f":"MATCH(D4,Отчет!$D:$D,0)","v":56}]
[1689615754,10,"БМО152",1171524899,"Смагина Александра Владимировна","М151БМОТН044","Проект Международная конференция Всемирной ассоциации исследователей общественного мнения на тему \"Survey Research and the Study of Social and Cultural Change\"",0,"Зачет","2016/2017 учебный год 1 модуль",null,0,0,1,1,null,null,null,null,0,"Международные отношения",{"$f":"MATCH(D5,Отчет!$D:$D,0)","v":28}]
[1567584525,9,"БМО152",1181084770,"Царенкова Татьяна","М151БМОТН085","\"Мягкая сила\" и содействие международному развитию",3,"Экзамен","2016/2017 учебный год 2 модуль",null,27,3,1,1,1546806085,2098,null,"stChoosen",0,"Международные отношения",{"$f":"MATCH(D6,Отчет!$D:$D,0)","v":43}]
[1567584387,10,"БМО152",1171524480,"Купцов Александр Владимирович","М151БМОТН028","\"Мягкая сила\" и содействие международному развитию",3,"Экзамен","2016/2017 учебный год 2 модуль",null,30,3,1,1,1546806085,2098,null,"stChoosen",0,"Международные отношения",{"$f":"MATCH(D7,Отчет!$D:$D,0)","v":31}]
[1567584491,8,"БМО152",1181077833,"Томчук Виктория Викторовна","М151БМОТН068","\"Мягкая сила\" и содействие международному развитию",3,"Экзамен","2016/2017 учебный год 2 модуль",null,24,3,1,1,1546806085,2098,null,"stChoosen",0,"Международные отношения",{"$f":"MATCH(D8,Отчет!$D:$D,0)","v":45}]
[1567584513,8,"БМО152",1181077931,"Хромова Альбина Олеговна","М151БМОТН070","\"Мягкая сила\" и содействие международному развитию",3,"Экзамен","2016/2017 учебный год 2 модуль",null,24,3,1,1,1546806085,2098,null,"stChoosen",0,"Международные отношения",{"$f":"MATCH(D9,Отчет!$D:$D,0)","v":58}]
[1567584535,6,"БМО152",1181078125,"Черезов Евгений Сергеевич","М151БМОТН061","\"Мягкая сила\" и содействие международному развитию",3,"Экзамен","2016/2017 учебный год 2 модуль",null,18,3,1,1,1546806085,2098,null,"stChoosen",0,"Международные отношения",{"$f":"MATCH(D10,Отчет!$D:$D,0)","v":69}]
[1567584362,9,"БМО151",1181078173,"Игаз Роман","М151БМОТН056","\"Мягкая сила\" и содействие международному развитию",3,"Экзамен","2016/2017 учебный год 2 модуль",null,27,3,1,1,1546806085,2098,null,"stChoosen",0,"Международные отношения",{"$f":"MATCH(D11,Отчет!$D:$D,0)","v":59}]
[1567584275,8,"БМО151",1171526035,"Галимова Алина Ленаровна","М151БМОТН009","\"Мягкая сила\" и содействие международному развитию",3,"Экзамен","2016/2017 учебный год 2 модуль",null,24,3,1,1,1546806085,2098,null,"stChoosen",0,"Международные отношения",{"$f":"MATCH(D12,Отчет!$D:$D,0)","v":23}]
[1567584301,9,"БМО151",1171526099,"Горшенина Анастасия Сергеевна","М151БМОТН012","\"Мягкая сила\" и содействие международному развитию",3,"Экзамен","2016/2017 учебный год 2 модуль",null,27,3,1,1,1546806085,2098,null,"stChoosen",0,"Международные отношения",{"$f":"MATCH(D13,Отчет!$D:$D,0)","v":18}]
[1567584579,10,"БМО152",1171526131,"Юхим Инна Михайловна","М151БМОТН053","\"Мягкая сила\" и содействие международному развитию",3,"Экзамен","2016/2017 учебный год 2 модуль",null,30,3,1,1,1546806085,2098,null,"stChoosen",0,"Международные отношения",{"$f":"MATCH(D14,Отчет!$D:$D,0)","v":17}]
[1567584326,7,"БМО151",1171525582,"Елизарова Анастасия Константиновна","М151БМОТН016","\"Мягкая сила\" и содействие международному развитию",3,"Экзамен","2016/2017 учебный год 2 модуль",null,21,3,1,0,1546806085,2098,null,"stChoosen",0,"Международные отношения",{"$f":"MATCH(D15,Отчет!$D:$D,0)","v":67}]
[1567584350,8,"БМО151",1171525610,"Зиборов Данил Васильевич","М151БМОТН019","\"Мягкая сила\" и содействие международному развитию",3,"Экзамен","2016/2017 учебный год 2 модуль",null,24,3,1,0,1546806085,2098,null,"stChoosen",0,"Международные отношения",{"$f":"MATCH(D16,Отчет!$D:$D,0)","v":50}]
[1567584457,10,"БМО152",1171525758,"Рыбакова Мария Дмитриевна","М151БМОТН039","\"Мягкая сила\" и содействие международному развитию",3,"Экзамен","2016/2017 учебный год 2 модуль",null,30,3,1,1,1546806085,2098,null,"stChoosen",0,"Международные отношения",{"$f":"MATCH(D17,Отчет!$D:$D,0)","v":27}]
[1567595319,10,"БМО151",1171525326,"Егорычева Екатерина Ильинична","М151БМОТН015","\"Мягкая сила\" и содействие международному развитию",3,"Экзамен","2016/2017 учебный год 2 модуль",null,30,3,1,0,1546806085,2098,null,"stChoosen",0,"Международные отношения",{"$f":"MATCH(D18,Отчет!$D:$D,0)","v":13}]
[1567584247,9,"БМО151",1171525422,"Афанасьева Елена Михайловна","М151БМОТН003","\"Мягкая сила\" и содействие международному развитию",3,"Экзамен","2016/2017 учебный год 2 модуль",null,27,3,1,0,1546806085,2098,null,"stChoosen",0,"Международные отношения",{"$f":"MATCH(D19,Отчет!$D:$D,0)","v":37}]
[1567595356,6,"БМО152",1171525454,"Самородова Алена Дмитриевна","М151БМОТН040","\"Мягкая сила\" и содействие международному развитию",3,"Экзамен","2016/2017 учебный год 2 модуль",null,18,3,1,0,1546806085,2098,null,"stChoosen",0,"Международные отношения",{"$f":"MATCH(D20,Отчет!$D:$D,0)","v":68}]
{"$rows_left_out":1385}