{"text_format":"1","workbook":"xlsx","n_sheets":2,"sheets":["Отчет","Данные"],"not_rendered":{"charts":0,"images":1,"macros":1,"external_links":0,"defined_names":0,"comments":0,"pivot_tables":0},"unopened":[],"bounds":{"document_bytes":16777216,"sheet_cells":100000,"rows_first":2000,"rows_last":500,"rows_between":2000,"halvings":0,"cell_chars":16384,"cell_head_chars":4096},"cells_cut":0,"cells_raw":0,"read":"whole","date_system":"1900"}

{"sheet":"Отчет","index":0,"n_rows":80,"n_cols":30,"rows_kept":80,"cut":false,"hidden":false,"merged":[[7,13,10,13],[7,12,10,12],[7,10,10,10],[7,11,10,11],[7,3,9,3],[7,5,9,5],[8,15,8,19],[7,15,7,20],[8,22,8,27],[7,22,7,29],[8,28,8,29],[7,8,10,8],[7,9,10,9],[10,0,10,4],[7,2,9,2],[7,4,9,4],[7,0,9,0],[7,6,9,6],[33,0,34,0],[43,0,44,0],[48,0,49,0],[62,0,64,0],[7,1,9,1]]}
["Кумулятивный рейтинг студентов"]
["Дата выгрузки: 15.07.2019"]
["Период: с начала обучения по  2018/2019 учебный год II семестр"]
["Факультет/отделение: факультет бизнеса и менеджмента"]
["Направление  подготовки: Бизнес-информатика"]
["Уровень образования, номер курса: Бакалавриат 1 курс"]
[]
["Место","Номер зачетной книжки","Студент","ID","Группа","Образовательная программа студента","Вид места",null,"Кумулятивный рейтинг","Сумма оценок","Количество оценок","Средняя оценка","Минимальный балл","Номер места","2018/2019 учебный год 1 модуль","2018/2019 учебный год 2 модуль",null,null,null,null,null,"2018/2019 учебный год 3 модуль","2018/2019 учебный год 4 модуль"]
[null,null,null,null,null,null,null,null,null,null,null,null,null,null,"Экзамен","Экзамен",null,null,null,null,"Зачет","Экзамен","Экзамен",null,null,null,null,null,"Зачет"]
[null,null,null,null,null,null,null,null,null,null,null,null,null,null,"Безопасность жизнедеятельности","Алгебра и геометрия","История","Математический анализ","Право","Философия","Физическая культура","Проектный семинар","Английский язык","Дискретная математика","Математический анализ","Программирование","Теоретические основы информатики","Экономика","Проект Прикладной проект в области цифровых инноваций","Физическая культура"]
["Число кумулятивных кредитов:",null,null,null,null,null,null,null,null,null,null,null,null,null,1,6,4,3.5,4,4,0,5,16,7,8,7,5,4,5,0]
[1,"М181БЦИУП031","Курданова Наталья Андреевна",2589785565,"БЦИ181","Цифровые инновации в управлении предприятием (программа двух дипломов НИУ ВШЭ и Лондонского университета)","Комм",{"$f":"MATCH(D12,Данные!$D$1:$D$65536,0)","v":31},692.5,123,13,{"$f":"IF(K12 > 0,J12/K12,0)","v":9.4615384615384617},{"$f":"MIN($O12:AD12)","v":8},1,9,8,10,9,9,10,"+",10,8,10,10,10,10,10,"нет оценки","+"]
[2,"М181БЦИУП062","Ширманкина Екатерина Юрьевна",2589785080,"БЦИ182","Цифровые инновации в управлении предприятием (программа двух дипломов НИУ ВШЭ и Лондонского университета)","Комм",{"$f":"MATCH(D13,Данные!$D$1:$D$65536,0)","v":11},679,120,13,9.2307692307692299,{"$f":"MIN($O13:AD13)","v":8},2,9,9,9,10,9,9,"+",10,8,10,10,9,10,8,"нет оценки","+"]
[3,"М181БЦИУП049","Стрельникова Валерия Олеговна",2589785228,"БЦИ182","Цифровые инновации в управлении предприятием (программа двух дипломов НИУ ВШЭ и Лондонского университета)","Комм",{"$f":"MATCH(D14,Данные!$D$1:$D$65536,0)","v":17},669.5,118,13,9.0769230769230766,{"$f":"MIN($O14:AD14)","v":8},3,10,9,9,9,8,9,"+",10,9,8,9,9,9,10,"нет оценки","+"]
[4,"М181БЦИУП050","Субботина Алина Евгеньевна",2589786288,"БЦИ182","Цифровые инновации в управлении предприятием (программа двух дипломов НИУ ВШЭ и Лондонского университета)","Комм",{"$f":"MATCH(D15,Данные!$D$1:$D$65536,0)","v":59},666,120,13,9.2307692307692299,{"$f":"MIN($O15:AD15)","v":7},4,10,10,8,10,9,8,"+",10,7,10,10,9,10,9,"нет оценки","+"]
[5,"М181БЦИУП006","Богатырькова Дарья Михайловна",2589786433,"БЦИ181","Цифровые инновации в управлении предприятием (программа двух дипломов НИУ ВШЭ и Лондонского университета)","Комм",{"$f":"MATCH(D16,Данные!$D$1:$D$65536,0)","v":65},658,116,13,8.9230769230769234,{"$f":"MIN($O16:AD16)","v":8},5,9,8,10,8,9,8,"+",10,8,10,9,9,10,8,"нет оценки","+"]
[6,"М181БЦИУП030","Кунин Илья Евгеньевич",2589786239,"БЦИ181","Цифровые инновации в управлении предприятием (программа двух дипломов НИУ ВШЭ и Лондонского университета)","Комм",{"$f":"MATCH(D17,Данные!$D$1:$D$65536,0)","v":57},657,118,13,9.0769230769230766,{"$f":"MIN($O17:AD17)","v":7},6,10,10,8,10,9,8,"+",10,7,10,9,10,10,7,"нет оценки","+"]
[7,"М181БЦИУП057","Филичкин Андрей Дмитриевич",2589785325,"БЦИ182","Цифровые инновации в управлении предприятием (программа двух дипломов НИУ ВШЭ и Лондонского университета)","Комм",{"$f":"MATCH(D18,Данные!$D$1:$D$65536,0)","v":21},649.5,113,13,8.6923076923076916,{"$f":"MIN($O18:AD18)","v":7},7,10,7,9,9,8,8,"+",10,9,9,10,8,9,7,"нет оценки","+"]
[8,"М181БЦИУП040","Пятых Владимир Владимирович",2589785128,"БЦИ182","Цифровые инновации в управлении предприятием (программа двух дипломов НИУ ВШЭ и Лондонского университета)","Комм",{"$f":"MATCH(D19,Данные!$D$1:$D$65536,0)","v":13},644.5,113,13,8.6923076923076916,{"$f":"MIN($O19:AD19)","v":7},8,10,8,9,7,8,8,"+",10,9,10,7,8,10,9,"нет оценки","+"]
[9,"М181БЦИУП046","Старцев Андрей Павлович",2589785397,"БЦИ182","Цифровые инновации в управлении предприятием (программа двух дипломов НИУ ВШЭ и Лондонского университета)","Комм",{"$f":"MATCH(D20,Данные!$D$1:$D$65536,0)","v":24},644,113,13,8.6923076923076916,{"$f":"MIN($O20:AD20)","v":7},9,9,8,9,8,8,9,"+",10,9,8,7,9,10,9,"нет оценки","+"]
[10,"М181БЦИУП019","Зюба Иван Александрович",2589786312,"БЦИ181","Цифровые инновации в управлении предприятием (программа двух дипломов НИУ ВШЭ и Лондонского университета)","Комм",{"$f":"MATCH(D21,Данные!$D$1:$D$65536,0)","v":60},638.5,117,13,9,{"$f":"MIN($O21:AD21)","v":6},10,10,8,8,9,9,9,"+",10,6,10,10,9,10,9,"нет оценки","+"]
[]
[11,"М181БЦИУП027","Кривошеева Влада Олеговна",2589786650,"БЦИ181","Цифровые инновации в управлении предприятием (программа двух дипломов НИУ ВШЭ и Лондонского университета)","Комм",{"$f":"MATCH(D23,Данные!$D$1:$D$65536,0)","v":69},626.5,112,13,{"$f":"IF(K23 > 0,J23/K23,0)","v":8.615384615384615},{"$f":"MIN($O23:AD23)","v":6},11,10,8,10,9,9,8,"+",8,8,9,10,6,8,9,"нет оценки","+"]
[12,"М181БЦИУП059","Черненко Денис Сергеевич",2589785819,"БЦИ182","Цифровые инновации в управлении предприятием (программа двух дипломов НИУ ВШЭ и Лондонского университета)","Комм",{"$f":"MATCH(D24,Данные!$D$1:$D$65536,0)","v":41},625,113,13,8.6923076923076916,{"$f":"MIN($O24:AD24)","v":7},12,10,9,9,8,8,8,"+",10,7,9,8,9,9,9,"нет оценки","+"]
[13,"М181БЦИУП007","Богачев Денис Александрович",2589786361,"БЦИ181","Цифровые инновации в управлении предприятием (программа двух дипломов НИУ ВШЭ и Лондонского университета)","Комм",{"$f":"MATCH(D25,Данные!$D$1:$D$65536,0)","v":62},619.5,106,13,8.1538461538461533,{"$f":"MIN($O25:AD25)","v":5},13,9,9,9,9,5,7,"+",10,9,7,10,7,9,6,"нет оценки","+"]
[14,"М181БЦИУП014","Демин Артем Михайлович",2589785032,"БЦИ181","Цифровые инновации в управлении предприятием (программа двух дипломов НИУ ВШЭ и Лондонского университета)","Комм",{"$f":"MATCH(D26,Данные!$D$1:$D$65536,0)","v":9},619,111,13,8.5384615384615383,{"$f":"MIN($O26:AD26)","v":7},14,10,7,8,8,8,8,"+",9,7,10,9,9,9,9,"нет оценки","+"]
[15,"М181БЦИУП038","Никифоров Кирилл Сергеевич",2589785867,"БЦИ182","Цифровые инновации в управлении предприятием (программа двух дипломов НИУ ВШЭ и Лондонского университета)","Комм",{"$f":"MATCH(D27,Данные!$D$1:$D$65536,0)","v":43},604,108,13,8.3076923076923084,{"$f":"MIN($O27:AD27)","v":5},15,10,9,8,6,8,8,"+",10,8,7,5,10,10,9,"нет оценки","+"]
[16,"М181БЦИУП053","Тимергазина Алина Вячеславовна",2589785541,"БЦИ182","Цифровые инновации в управлении предприятием (программа двух дипломов НИУ ВШЭ и Лондонского университета)","Комм",{"$f":"MATCH(D28,Данные!$D$1:$D$65536,0)","v":30},594.5,101,13,7.7692307692307692,{"$f":"MIN($O28:AD28)","v":5},16,9,7,6,5,8,8,"+",9,9,9,8,7,9,7,"нет оценки","+"]
[17,"М181БЦИУП010","Геворкян Вероника Георгиевна",2589786458,"БЦИ181","Цифровые инновации в управлении предприятием (программа двух дипломов НИУ ВШЭ и Лондонского университета)","Комм",{"$f":"MATCH(D29,Данные!$D$1:$D$65536,0)","v":66},593.5,104,13,8,{"$f":"MIN($O29:AD29)","v":5},17,9,6,9,5,8,8,"+",10,8,9,8,7,9,8,"нет оценки","+"]
[18,"М181БЦИУП025","Колчина Наталья Александровна",2589786039,"БЦИ181","Цифровые инновации в управлении предприятием (программа двух дипломов НИУ ВШЭ и Лондонского университета)","Комм",{"$f":"MATCH(D30,Данные!$D$1:$D$65536,0)","v":49},585.5,103,13,7.9230769230769234,{"$f":"MIN($O30:AD30)","v":5},18,10,7,10,7,8,8,"+",10,10,7,5,5,7,9,"нет оценки","+"]
[19,"М181БЦИУП005","Арзуманян Нина Граатовна",2589785252,"БЦИ181","Цифровые инновации в управлении предприятием (программа двух дипломов НИУ ВШЭ и Лондонского университета)","Комм",{"$f":"MATCH(D31,Данные!$D$1:$D$65536,0)","v":18},577.5,103,13,7.9230769230769234,{"$f":"MIN($O31:AD31)","v":5},19,10,5,9,5,9,8,"+",10,8,10,7,5,9,8,"нет оценки","+"]
[20,"М181БЦИУП045","Семашко Валерия Георгиевна",2589785642,"БЦИ182","Цифровые инновации в управлении предприятием (программа двух дипломов НИУ ВШЭ и Лондонского университета)","Комм",{"$f":"MATCH(D32,Данные!$D$1:$D$65536,0)","v":34},569,98,13,7.5384615384615383,{"$f":"MIN($O32:AD32)","v":4},20,10,9,7,8,5,6,"+",7,9,8,8,4,10,7,"нет оценки","+"]
[21,"М181БЦИУП023","Кобринская Валерия Сергеевна",2589785795,"БЦИ181","Цифровые инновации в управлении предприятием (программа двух дипломов НИУ ВШЭ и Лондонского университета)","Комм",{"$f":"MATCH(D33,Данные!$D$1:$D$65536,0)","v":40},567.5,101,13,7.7692307692307692,{"$f":"MIN($O33:AD33)","v":5},21,8,5,8,7,10,8,"+",10,8,8,6,6,9,8,"нет оценки","+"]
["22 - 23","М181БЦИУП039","Поспелов Федор Юрьевич",2589786015,"БЦИ182","Цифровые инновации в управлении предприятием (программа двух дипломов НИУ ВШЭ и Лондонского университета)","Комм",{"$f":"MATCH(D34,Данные!$D$1:$D$65536,0)","v":48},566,102,13,7.8461538461538458,{"$f":"MIN($O34:AD34)","v":6},22,10,7,9,8,8,9,"+",8,8,8,6,6,8,7,"нет оценки","+"]
[null,"М181БЦИУП065","Яценко Данила Александрович",2589785967,"БЦИ182","Цифровые инновации в управлении предприятием (программа двух дипломов НИУ ВШЭ и Лондонского университета)","Комм",{"$f":"MATCH(D35,Данные!$D$1:$D$65536,0)","v":46},566,101,13,7.7692307692307692,{"$f":"MIN($O35:AD35)","v":5},23,10,8,9,6,7,8,"+",9,8,9,5,6,9,7,"нет оценки","+"]
[24,"М181БЦИУП026","Кравчук Екатерина Ивановна",2589785843,"БЦИ181","Цифровые инновации в управлении предприятием (программа двух дипломов НИУ ВШЭ и Лондонского университета)","Комм",{"$f":"MATCH(D36,Данные!$D$1:$D$65536,0)","v":42},564.5,99,13,7.615384615384615,{"$f":"MIN($O36:AD36)","v":5},24,8,5,8,9,8,7,"+",9,8,8,8,6,8,7,"нет оценки","+"]
[25,"М181БЦИУП020","Иванова Анастасия Сергеевна",2589785104,"БЦИ181","Цифровые инновации в управлении предприятием (программа двух дипломов НИУ ВШЭ и Лондонского университета)","Комм",{"$f":"MATCH(D37,Данные!$D$1:$D$65536,0)","v":12},561,100,13,7.6923076923076925,{"$f":"MIN($O37:AD37)","v":4},25,10,6,4,8,9,8,"+",8,7,8,9,7,10,6,"нет оценки","+"]
[26,"М181БЦИУП021","Каржанов Александр Павлович",2589786063,"БЦИ181","Цифровые инновации в управлении предприятием (программа двух дипломов НИУ ВШЭ и Лондонского университета)","Комм",{"$f":"MATCH(D38,Данные!$D$1:$D$65536,0)","v":50},560.5,98,13,7.5384615384615383,{"$f":"MIN($O38:AD38)","v":5},26,8,8,8,7,8,8,"+",10,8,7,6,7,8,5,"нет оценки","+"]
[27,"М181БЦИУП051","Третьякова Софья Олеговна",2589785918,"БЦИ182","Цифровые инновации в управлении предприятием (программа двух дипломов НИУ ВШЭ и Лондонского университета)","Комм",{"$f":"MATCH(D39,Данные!$D$1:$D$65536,0)","v":44},557.5,100,13,7.6923076923076925,{"$f":"MIN($O39:AD39)","v":3},27,9,8,8,5,8,9,"+",9,8,8,3,7,9,9,"нет оценки","+"]
[28,"М181БЦИУП042","Русенцов Арсений Сергеевич",2589785301,"БЦИ182","Цифровые инновации в управлении предприятием (программа двух дипломов НИУ ВШЭ и Лондонского университета)","Комм",{"$f":"MATCH(D40,Данные!$D$1:$D$65536,0)","v":20},557,96,13,7.384615384615385,{"$f":"MIN($O40:AD40)","v":4},28,9,5,9,4,8,8,"+",10,10,9,4,4,7,9,"нет оценки","+"]
{"$rows_left_out":41}
{"sheet":"Данные","index":1,"n_rows":1090,"n_cols":20,"rows_kept":1090,"cut":false,"hidden":true,"merged":[]}
["ID","Оценка из 10 баллов","Группа","Студент","Фамилия","Имя","Отчество","Номер студенческого билета","Строка учебного плана","Кумулятивных кредитов за испытание","Вид испытания","Календарный период по плану","Неявка","В кумулятивный рейтинг","Оценка зачет/назачет","Является бюджетным","Учебный план","Вид записи РУП","Вид дисциплины по ИУП","Номер Row"]
[1,2,3,4,5,6,7,8,9,10,11,12,13,14,15,16,17,18,19,20]
[2603356221,9,"БЦИ182",2593044053,"Кокорев Егор Сергеевич","М181БЦИУП068","Безопасность жизнедеятельности",1,"Экзамен","2018/2019 учебный год 1 модуль",null,9,1,0,2582579686,2098,null,"Цифровые инновации в управлении предприятием (программа двух дипломов НИУ ВШЭ и Лондонского университета)",{"$f":"MATCH(D3,Отчет!$D$1:$D$65537,0)","v":73}]
[2603518021,9,"БЦИ182",2593284091,"Титов Тимофей","М181БЦИУП066","Безопасность жизнедеятельности",1,"Экзамен","2018/2019 учебный год 1 модуль",null,9,1,0,2582579686,2098,null,"Цифровые инновации в управлении предприятием (программа двух дипломов НИУ ВШЭ и Лондонского университета)",{"$f":"MATCH(D4,Отчет!$D$1:$D$65537,0)","v":42}]
[2622077182,4,"БЦИ182",2619523336,"Похилов Евгений","М181БЦИУП069","Безопасность жизнедеятельности",1,"Экзамен","2018/2019 учебный год 1 модуль",null,4,1,0,2582579686,2098,null,"Цифровые инновации в управлении предприятием (программа двух дипломов НИУ ВШЭ и Лондонского университета)",{"$f":"MATCH(D5,Отчет!$D$1:$D$65537,0)","v":64}]
[2831103536,6,"БЦИ182",2828889075,"Васильчук Арсений Алексеевич","М191БЦИУП001","Безопасность жизнедеятельности",1,"Экзамен","2018/2019 учебный год 1 модуль",null,6,1,0,2582579686,2098,null,"Цифровые инновации в управлении предприятием (программа двух дипломов НИУ ВШЭ и Лондонского университета)",{"$f":"MATCH(D6,Отчет!$D$1:$D$65537,0)","v":68}]
[2590939345,9,"БЦИ181",2589784960,"Коголо Джованни","М181БЦИУП024","Безопасность жизнедеятельности",1,"Экзамен","2018/2019 учебный год 1 модуль",null,9,1,0,2582579686,2098,null,"Цифровые инновации в управлении предприятием (программа двух дипломов НИУ ВШЭ и Лондонского университета)",{"$f":"MATCH(D7,Отчет!$D$1:$D$65537,0)","v":63}]
[2590935752,10,"БЦИ181",2589784984,"Абдужалилов Шухратджон Махсуджонович","М181БЦИУП001","Безопасность жизнедеятельности",1,"Экзамен","2018/2019 учебный год 1 модуль",null,10,1,0,2582579686,2098,null,"Цифровые инновации в управлении предприятием (программа двух дипломов НИУ ВШЭ и Лондонского университета)",{"$f":"MATCH(D8,Отчет!$D$1:$D$65537,0)","v":53}]
[2590937986,10,"БЦИ181",2589785032,"Демин Артем Михайлович","М181БЦИУП014","Безопасность жизнедеятельности",1,"Экзамен","2018/2019 учебный год 1 модуль",null,10,1,0,2582579686,2098,null,"Цифровые инновации в управлении предприятием (программа двух дипломов НИУ ВШЭ и Лондонского университета)",{"$f":"MATCH(D9,Отчет!$D$1:$D$65537,0)","v":26}]
[2590940646,9,"БЦИ181",2589785056,"Лапшина Елизавета Алексеевна","М181БЦИУП033","Безопасность жизнедеятельности",1,"Экзамен","2018/2019 учебный год 1 модуль",null,9,1,0,2582579686,2098,null,"Цифровые инновации в управлении предприятием (программа двух дипломов НИУ ВШЭ и Лондонского университета)",{"$f":"MATCH(D10,Отчет!$D$1:$D$65537,0)","v":50}]
[2590944529,9,"БЦИ182",2589785080,"Ширманкина Екатерина Юрьевна","М181БЦИУП062","Безопасность жизнедеятельности",1,"Экзамен","2018/2019 учебный год 1 модуль",null,9,1,0,2582579686,2098,null,"Цифровые инновации в управлении предприятием (программа двух дипломов НИУ ВШЭ и Лондонского университета)",{"$f":"MATCH(D11,Отчет!$D$1:$D$65537,0)","v":13}]
[2590938810,10,"БЦИ181",2589785104,"Иванова Анастасия Сергеевна","М181БЦИУП020","Безопасность жизнедеятельности",1,"Экзамен","2018/2019 учебный год 1 модуль",null,10,1,0,2582579686,2098,null,"Цифровые инновации в управлении предприятием (программа двух дипломов НИУ ВШЭ и Лондонского университета)",{"$f":"MATCH(D12,Отчет!$D$1:$D$65537,0)","v":37}]
[2590941623,10,"БЦИ182",2589785128,"Пятых Владимир Владимирович","М181БЦИУП040","Безопасность жизнедеятельности",1,"Экзамен","2018/2019 учебный год 1 модуль",null,10,1,0,2582579686,2098,null,"Цифровые инновации в управлении предприятием (программа двух дипломов НИУ ВШЭ и Лондонского университета)",{"$f":"MATCH(D13,Отчет!$D$1:$D$65537,0)","v":19}]
[2590938380,10,"БЦИ181",2589785152,"Земсков Кирилл Игоревич","М181БЦИУП017","Безопасность жизнедеятельности",1,"Экзамен","2018/2019 учебный год 1 модуль",null,10,1,0,2582579686,2098,null,"Цифровые инновации в управлении предприятием (программа двух дипломов НИУ ВШЭ и Лондонского университета)",{"$f":"MATCH(D14,Отчет!$D$1:$D$65537,0)","v":48}]
[2590944410,9,"БЦИ182",2589785177,"Шестопалов Артем Денисович","М181БЦИУП061","Безопасность жизнедеятельности",1,"Экзамен","2018/2019 учебный год 1 модуль",null,9,1,0,2582579686,2098,null,"Цифровые инновации в управлении предприятием (программа двух дипломов НИУ ВШЭ и Лондонского университета)",{"$f":"MATCH(D15,Отчет!$D$1:$D$65537,0)","v":67}]
[2590940925,9,"БЦИ181",2589785203,"Логинов Андрей Александрович","М181БЦИУП035","Безопасность жизнедеятельности",1,"Экзамен","2018/2019 учебный год 1 модуль",null,9,1,0,2582579686,2098,null,"Цифровые инновации в управлении предприятием (программа двух дипломов НИУ ВШЭ и Лондонского университета)",{"$f":"MATCH(D16,Отчет!$D$1:$D$65537,0)","v":62}]
[2590942854,10,"БЦИ182",2589785228,"Стрельникова Валерия Олеговна","М181БЦИУП049","Безопасность жизнедеятельности",1,"Экзамен","2018/2019 учебный год 1 модуль",null,10,1,0,2582579686,2098,null,"Цифровые инновации в управлении предприятием (программа двух дипломов НИУ ВШЭ и Лондонского университета)",{"$f":"MATCH(D17,Отчет!$D$1:$D$65537,0)","v":14}]
[2590936459,10,"БЦИ181",2589785252,"Арзуманян Нина Граатовна","М181БЦИУП005","Безопасность жизнедеятельности",1,"Экзамен","2018/2019 учебный год 1 модуль",null,10,1,0,2582579686,2098,null,"Цифровые инновации в управлении предприятием (программа двух дипломов НИУ ВШЭ и Лондонского университета)",{"$f":"MATCH(D18,Отчет!$D$1:$D$65537,0)","v":31}]
[2590942238,6,"БЦИ182",2589785277,"Савина Анастасия Павловна","М181БЦИУП044","Безопасность жизнедеятельности",1,"Экзамен","2018/2019 учебный год 1 модуль",null,6,1,0,2582579686,2098,null,"Цифровые инновации в управлении предприятием (программа двух дипломов НИУ ВШЭ и Лондонского университета)",{"$f":"MATCH(D19,Отчет!$D$1:$D$65537,0)","v":65}]
[2590941918,9,"БЦИ182",2589785301,"Русенцов Арсений Сергеевич","М181БЦИУП042","Безопасность жизнедеятельности",1,"Экзамен","2018/2019 учебный год 1 модуль",null,9,1,0,2582579686,2098,null,"Цифровые инновации в управлении предприятием (программа двух дипломов НИУ ВШЭ и Лондонского университета)",{"$f":"MATCH(D20,Отчет!$D$1:$D$65537,0)","v":40}]
[2590943879,10,"БЦИ182",2589785325,"Филичкин Андрей Дмитриевич","М181БЦИУП057","Безопасность жизнедеятельности",1,"Экзамен","2018/2019 учебный год 1 модуль",null,10,1,0,2582579686,2098,null,"Цифровые инновации в управлении предприятием (программа двух дипломов НИУ ВШЭ и Лондонского университета)",{"$f":"MATCH(D21,Отчет!$D$1:$D$65537,0)","v":18}]
[2590939090,10,"БЦИ181",2589785349,"Ким Ольга Андреевна","М181БЦИУП022","Безопасность жизнедеятельности",1,"Экзамен","2018/2019 учебный год 1 модуль",null,10,1,0,2582579686,2098,null,"Цифровые инновации в управлении предприятием (программа двух дипломов НИУ ВШЭ и Лондонского университета)",{"$f":"MATCH(D22,Отчет!$D$1:$D$65537,0)","v":46}]
[2590942728,9,"БЦИ182",2589785373,"Сторожева Анна Александровна","М181БЦИУП048","Безопасность жизнедеятельности",1,"Экзамен","2018/2019 учебный год 1 модуль",null,9,1,0,2582579686,2098,null,"Цифровые инновации в управлении предприятием (программа двух дипломов НИУ ВШЭ и Лондонского университета)",{"$f":"MATCH(D23,Отчет!$D$1:$D$65537,0)","v":56}]
[2590942493,9,"БЦИ182",2589785397,"Старцев Андрей Павлович","М181БЦИУП046","Безопасность жизнедеятельности",1,"Экзамен","2018/2019 учебный год 1 модуль",null,9,1,0,2582579686,2098,null,"Цифровые инновации в управлении предприятием (программа двух дипломов НИУ ВШЭ и Лондонского университета)",{"$f":"MATCH(D24,Отчет!$D$1:$D$65537,0)","v":20}]
[2590939899,9,"БЦИ181",2589785421,"Крылов Владимир Борисович","М181БЦИУП028","Безопасность жизнедеятельности",1,"Экзамен","2018/2019 учебный год 1 модуль",null,9,1,0,2582579686,2098,null,"Цифровые инновации в управлении предприятием (программа двух дипломов НИУ ВШЭ и Лондонского университета)",{"$f":"MATCH(D25,Отчет!$D$1:$D$65537,0)","v":60}]
[2590943476,8,"БЦИ182",2589785445,"Тряшин Арсений Андреевич","М181БЦИУП054","Безопасность жизнедеятельности",1,"Экзамен","2018/2019 учебный год 1 модуль",null,8,1,0,2582579686,2098,null,"Цифровые инновации в управлении предприятием (программа двух дипломов НИУ ВШЭ и Лондонского университета)",{"$f":"MATCH(D26,Отчет!$D$1:$D$65537,0)","v":71}]
[2590942065,9,"БЦИ182",2589785469,"Саадян Эдуард Эмилевич","М181БЦИУП043","Безопасность жизнедеятельности",1,"Экзамен","2018/2019 учебный год 1 модуль",null,9,1,0,2582579686,2098,null,"Цифровые инновации в управлении предприятием (программа двух дипломов НИУ ВШЭ и Лондонского университета)",{"$f":"MATCH(D27,Отчет!$D$1:$D$65537,0)","v":54}]
[2590943999,9,"БЦИ182",2589785493,"Черешнева Дарья Евгеньевна","М181БЦИУП058","Безопасность жизнедеятельности",1,"Экзамен","2018/2019 учебный год 1 модуль",null,9,1,0,2582579686,2098,null,"Цифровые инновации в управлении предприятием (программа двух дипломов НИУ ВШЭ и Лондонского университета)",{"$f":"MATCH(D28,Отчет!$D$1:$D$65537,0)","v":61}]
[2590941057,10,"БЦИ182",2589785517,"Любомский Глеб Николаевич","М181БЦИУП036","Безопасность жизнедеятельности",1,"Экзамен","2018/2019 учебный год 1 модуль",null,10,1,0,2582579686,2098,null,"Цифровые инновации в управлении предприятием (программа двух дипломов НИУ ВШЭ и Лондонского университета)",{"$f":"MATCH(D29,Отчет!$D$1:$D$65537,0)","v":43}]
[2590943353,9,"БЦИ182",2589785541,"Тимергазина Алина Вячеславовна","М181БЦИУП053","Безопасность жизнедеятельности",1,"Экзамен","2018/2019 учебный год 1 модуль",null,9,1,0,2582579686,2098,null,"Цифровые инновации в управлении предприятием (программа двух дипломов НИУ ВШЭ и Лондонского университета)",{"$f":"MATCH(D30,Отчет!$D$1:$D$65537,0)","v":28}]
[2590940364,9,"БЦИ181",2589785565,"Курданова Наталья Андреевна","М181БЦИУП031","Безопасность жизнедеятельности",1,"Экзамен","2018/2019 учебный год 1 модуль",null,9,1,0,2582579686,2098,null,"Цифровые инновации в управлении предприятием (программа двух дипломов НИУ ВШЭ и Лондонского университета)",{"$f":"MATCH(D31,Отчет!$D$1:$D$65537,0)","v":12}]
[2590940792,10,"БЦИ181",2589785593,"Линькова Маргарита Константиновна","М181БЦИУП034","Безопасность жизнедеятельности",1,"Экзамен","2018/2019 учебный год 1 модуль",null,10,1,0,2582579686,2098,null,"Цифровые инновации в управлении предприятием (программа двух дипломов НИУ ВШЭ и Лондонского университета)",{"$f":"MATCH(D32,Отчет!$D$1:$D$65537,0)","v":59}]
[2590937502,10,"БЦИ181",2589785617,"Грачева Елизавета Алексеевна","М181БЦИУП011","Безопасность жизнедеятельности",1,"Экзамен","2018/2019 учебный год 1 модуль",null,10,1,0,2582579686,2098,null,"Цифровые инновации в управлении предприятием (программа двух дипломов НИУ ВШЭ и Лондонского университета)",{"$f":"MATCH(D33,Отчет!$D$1:$D$65537,0)","v":49}]
[2590942364,10,"БЦИ182",2589785642,"Семашко Валерия Георгиевна","М181БЦИУП045","Безопасность жизнедеятельности",1,"Экзамен","2018/2019 учебный год 1 модуль",null,10,1,0,2582579686,2098,null,"Цифровые инновации в управлении предприятием (программа двух дипломов НИУ ВШЭ и Лондонского университета)",{"$f":"MATCH(D34,Отчет!$D$1:$D$65537,0)","v":32}]
[2590937863,9,"БЦИ181",2589785668,"Дежкин Кирилл Константинович","М181БЦИУП013","Безопасность жизнедеятельности",1,"Экзамен","2018/2019 учебный год 1 модуль",null,9,1,0,2582579686,2098,null,"Цифровые инновации в управлении предприятием (программа двух дипломов НИУ ВШЭ и Лондонского университета)",{"$f":"MATCH(D35,Отчет!$D$1:$D$65537,0)","v":57}]
[2590944279,9,"БЦИ182",2589785695,"Шаталов Михаил Андреевич","М181БЦИУП060","Безопасность жизнедеятельности",1,"Экзамен","2018/2019 учебный год 1 модуль",null,9,1,0,2582579686,2098,null,"Цифровые инновации в управлении предприятием (программа двух дипломов НИУ ВШЭ и Лондонского университета)",{"$f":"MATCH(D36,Отчет!$D$1:$D$65537,0)","v":41}]
[2590936847,10,"БЦИ181",2589785722,"Гавердовский Никита Анатольевич","М181БЦИУП008","Безопасность жизнедеятельности",1,"Экзамен","2018/2019 учебный год 1 модуль",null,10,1,0,2582579686,2098,null,"Цифровые инновации в управлении предприятием (программа двух дипломов НИУ ВШЭ и Лондонского университета)",{"$f":"MATCH(D37,Отчет!$D$1:$D$65537,0)","v":55}]
[2590943749,10,"БЦИ182",2589785747,"Тютюнников Максим Олегович","М181БЦИУП056","Безопасность жизнедеятельности",1,"Экзамен","2018/2019 учебный год 1 модуль",null,10,1,0,2582579686,2098,null,"Цифровые инновации в управлении предприятием (программа двух дипломов НИУ ВШЭ и Лондонского университета)",{"$f":"MATCH(D38,Отчет!$D$1:$D$65537,0)","v":76}]
[2590943228,10,"БЦИ182",2589785771,"Тер-Данильянц Михаил Леонидович","М181БЦИУП052","Безопасность жизнедеятельности",1,"Экзамен","2018/2019 учебный год 1 модуль",null,10,1,0,2582579686,2098,null,"Цифровые инновации в управлении предприятием (программа двух дипломов НИУ ВШЭ и Лондонского университета)",{"$f":"MATCH(D39,Отчет!$D$1:$D$65537,0)","v":45}]
[2590939213,8,"БЦИ181",2589785795,"Кобринская Валерия Сергеевна","М181БЦИУП023","Безопасность жизнедеятельности",1,"Экзамен","2018/2019 учебный год 1 модуль",null,8,1,0,2582579686,2098,null,"Цифровые инновации в управлении предприятием (программа двух дипломов НИУ ВШЭ и Лондонского университета)",{"$f":"MATCH(D40,Отчет!$D$1:$D$65537,0)","v":33}]
{"$rows_left_out":1050}